{"text_format":"1","workbook":"xlsx","n_sheets":31,"sheets":["open","A_skupiny","A_finale","A_utecha","B_skupiny","B_finale","B_utecha","C_skupiny","div_4","div_5","1divize-A","1divize-B","2divize-A","2divize-B","3divize-A","C_finale","3divize-B","C_utecha","4divize-A","4divize-A_2","5divize-A","5divize-A_2","D_skupiny","D_finale","D_utecha","celkem","utecha_umisteni_3","utecha_umisteni_4","utecha_umisteni_5","utecha_umisteni_6","makro"],"not_rendered":{"charts":0,"images":0,"macros":1,"external_links":0,"defined_names":2,"comments":0,"pivot_tables":0},"unopened":[],"bounds":{"document_bytes":16777216,"sheet_cells":100000,"rows_first":2000,"rows_last":500,"rows_between":2000,"halvings":0,"cell_chars":16384,"cell_head_chars":4096},"cells_cut":0,"cells_raw":0,"read":"whole","date_system":"1900"}

{"sheet":"open","index":0,"n_rows":156,"n_cols":7,"rows_kept":156,"cut":false,"hidden":true,"merged":[]}
[null,"U11",2011,null,null,"open"]
[]
[null,"Adamíra Šimon ",2007,{"$f":"IF(C3=\"\",\"\",IF(C3>=$C$1,\"U11\",IF(C3>=$C$1-2,\"U13\",IF(C3>=$C$1-4,\"U15\",IF(C3>=$C$1-6,\"U17\",\"U19\")))))","v":"U15"},"ch","Sokol Tatobity",{"$f":"B3&\"  \"&\"(\"&F3&\")\"&\" - \"&D3","v":"Adamíra Šimon   (Sokol Tatobity) - U15"}]
[null,"Bartoň David  ",2007,{"$f":"IF(C4=\"\",\"\",IF(C4>=$C$1,\"U11\",IF(C4>=$C$1-2,\"U13\",IF(C4>=$C$1-4,\"U15\",IF(C4>=$C$1-6,\"U17\",\"U19\")))))","v":"U15"},"ch","SKST Liberec","Bartoň David    (SKST Liberec) - U15"]
[null,"Beneš Lukáš  ",null,"","ch","Spartak Chrastava","Beneš Lukáš    (Spartak Chrastava) - "]
[null,"Benešová Nikola",2007,"U15","d","Spartak Chrastava","Benešová Nikola  (Spartak Chrastava) - U15"]
[null,"Bitman Matěj  ",2007,"U15","ch","KMST Liberec","Bitman Matěj    (KMST Liberec) - U15"]
[null,"Brunclík Jan  ",2005,"U17","ch","Spartak Smržovka","Brunclík Jan    (Spartak Smržovka) - U17"]
[null,"Csizmazia Antonín ",2011,"U11","ch","STAR Turnov","Csizmazia Antonín   (STAR Turnov) - U11"]
[null,"Černohub Vít  ",2010,"U13","ch","Jiskra Nový Bor","Černohub Vít    (Jiskra Nový Bor) - U13"]
[null,"Čupcová Valerie  ",2012,"U11","d","Jiskra Nový Bor","Čupcová Valerie    (Jiskra Nový Bor) - U11"]
[null,"Čupcová Viktorie ",2009,"U13","d","Jiskra Nový Bor","Čupcová Viktorie   (Jiskra Nový Bor) - U13"]
[null,"Faltus Dominik ",2008,"U15","ch","KMST Liberec","Faltus Dominik   (KMST Liberec) - U15"]
[null,"Fiřt Jan ",2009,"U13","ch","SKST Liberec","Fiřt Jan   (SKST Liberec) - U13"]
[null,"Fišer Václav ",2007,"U15","ch","KMST Liberec","Fišer Václav   (KMST Liberec) - U15"]
[null,"Flégr Samuel ",2006,"U17","ch","KMST Liberec","Flégr Samuel   (KMST Liberec) - U17"]
[null,"Gajdoš Matyáš  ",2011,"U11","ch","SKST Liberec","Gajdoš Matyáš    (SKST Liberec) - U11"]
[null,"Hanoušek Adam ",2009,"U13","ch","STAR Turnov","Hanoušek Adam   (STAR Turnov) - U13"]
[null,"Hanus Antonín  ",2008,"U15","ch","Jiskra K. Šenov","Hanus Antonín    (Jiskra K. Šenov) - U15"]
[null,"Hanus Ondřej  ",2010,"U13","ch","Jiskra K. Šenov","Hanus Ondřej    (Jiskra K. Šenov) - U13"]
[null,"Hanusová Karolína ",2010,"U13","d","Jiskra K. Šenov","Hanusová Karolína   (Jiskra K. Šenov) - U13"]
[null,"Harries Charlie",2008,"U15","ch","SKST Liberec","Harries Charlie  (SKST Liberec) - U15"]
[null,"Holasová Sofie  ",2007,"U15","d","SKST Liberec","Holasová Sofie    (SKST Liberec) - U15"]
[null,"Hůlková Anna  ",2005,"U17","d","SKST Liberec","Hůlková Anna    (SKST Liberec) - U17"]
[null,"Iodi Nela ",2008,"U15","d","Spartak Chrastava","Iodi Nela   (Spartak Chrastava) - U15"]
[null,"Jandák Jan  ",2004,"U19","ch","SKST Liberec","Jandák Jan    (SKST Liberec) - U19"]
[null,"Jungmann Matěj ",2012,"U11","ch","SKST Liberec","Jungmann Matěj   (SKST Liberec) - U11"]
[null,"Kahan Ondřej ",2007,"U15","ch","SKST Liberec","Kahan Ondřej   (SKST Liberec) - U15"]
[null,"Klustová Tereza",2007,"U15","d","Spartak Chrastava","Klustová Tereza  (Spartak Chrastava) - U15"]
[null,"Kobosil Tomáš ",2007,"U15","ch","SKST Liberec","Kobosil Tomáš   (SKST Liberec) - U15"]
[null,"Komár Jan  ",2009,"U13","ch","SKST Liberec","Komár Jan    (SKST Liberec) - U13"]
[null,"Königová Anežka  ",2008,"U15","d","STAR Turnov","Königová Anežka    (STAR Turnov) - U15"]
[null,"Korpová Romana",2007,"U15","d","SKST Liberec","Korpová Romana  (SKST Liberec) - U15"]
[null,"Korpová Tereza ",2012,"U11","d","AST Kamenický Šenov","Korpová Tereza   (AST Kamenický Šenov) - U11"]
[null,"Kos Vincent  ",2009,"U13","ch","SKST Liberec",{"$f":"B35&\"  \"&\"(\"&F35&\")\"&\" - \"&D35","v":"Kos Vincent    (SKST Liberec) - U13"}]
[null,"Kosař Václav  ",2003,"U19","ch","Sokol Turnov","Kosař Václav    (Sokol Turnov) - U19"]
[null,"Košťák Matěj ",2007,"U15","ch","B.  Jablonec n. N.","Košťák Matěj   (B.  Jablonec n. N.) - U15"]
[null,"Kovář Samuel ",2009,"U13","ch","SKST Liberec","Kovář Samuel   (SKST Liberec) - U13"]
[null,"Kožich Vítek ",2010,"U13","ch","SKST Liberec","Kožich Vítek   (SKST Liberec) - U13"]
[null,"Krotilová Adéla ",2007,"U15","d","SKST Liberec","Krotilová Adéla   (SKST Liberec) - U15"]
[null,"Křivánek Viktor ",2011,"U11","ch","Jiskra K. Šenov","Křivánek Viktor   (Jiskra K. Šenov) - U11"]
[null,"Kubíček Tomáš ",2007,"U15","ch","STAR Turnov","Kubíček Tomáš   (STAR Turnov) - U15"]
[null,"Kuntoš Filip ",2006,"U17","ch","SKST Liberec","Kuntoš Filip   (SKST Liberec) - U17"]
[null,"Kutěj Štěpán ",2007,"U15","ch","STAR Turnov","Kutěj Štěpán   (STAR Turnov) - U15"]
[null,"Moravec David  ",2011,"U11","ch","KMST Liberec","Moravec David    (KMST Liberec) - U11"]
[null,"Motl Matyáš  ",2009,"U13","ch","KMST Liberec","Motl Matyáš    (KMST Liberec) - U13"]
[null,"Motlík Denis ",2008,"U15","ch","Loko Česká Lípa","Motlík Denis   (Loko Česká Lípa) - U15"]
[null,"Motlík Lukáš  ",2004,"U19","ch","Loko Česká Lípa","Motlík Lukáš    (Loko Česká Lípa) - U19"]
[null,"Nechvíl Richard  ",2008,"U15","ch","STAR Turnov","Nechvíl Richard    (STAR Turnov) - U15"]
[null,"Němec Štěpán  ",2008,"U15","ch","SKST Liberec","Němec Štěpán    (SKST Liberec) - U15"]
[null,"Nohejl Martin ",2005,"U17","ch","ST Frýdlant","Nohejl Martin   (ST Frýdlant) - U17"]
[null,"Nohejl Matěj ",2005,"U17","ch","ST Frýdlant","Nohejl Matěj   (ST Frýdlant) - U17"]
[null,"Nohejl Václav  ",2005,"U17","ch","ST Frýdlant","Nohejl Václav    (ST Frýdlant) - U17"]
[null,"Nováková Tereza  ",2006,"U17","d","Spartak Chrastava","Nováková Tereza    (Spartak Chrastava) - U17"]
[null,"Opluštil Jan ",2006,"U17","ch","STAR Turnov","Opluštil Jan   (STAR Turnov) - U17"]
[null,"Ortová Pavlína  ",2009,"U13","d","SKST Liberec","Ortová Pavlína    (SKST Liberec) - U13"]
[null,"Panáček Filip  ",2009,"U13","ch","Loko Česká Lípa","Panáček Filip    (Loko Česká Lípa) - U13"]
[null,"Pavelková Terezie  ",2007,"U15","d","Spartak Chrastava","Pavelková Terezie    (Spartak Chrastava) - U15"]
[null,"Perlík Josef  ",2011,"U11","ch","KMST Liberec","Perlík Josef    (KMST Liberec) - U11"]
[null,"Petrusová Terezie ",2011,"U11","d","Jiskra K. Šenov","Petrusová Terezie   (Jiskra K. Šenov) - U11"]
[null,"Pytlounová Nikola ",2008,"U15","d","SKST Liberec","Pytlounová Nikola   (SKST Liberec) - U15"]
[null,"Rambousek Jan ",2008,"U15","ch","Spartak Chrastava","Rambousek Jan   (Spartak Chrastava) - U15"]
[null,"Rek Vít  ",2009,"U13","ch","Loko Česká Lípa","Rek Vít    (Loko Česká Lípa) - U13"]
[null,"Resl Teodor ",2011,"U11","ch","SKST Liberec","Resl Teodor   (SKST Liberec) - U11"]
[null,"Salaba Marek  ",2008,"U15","ch","Spartak Smržovka","Salaba Marek    (Spartak Smržovka) - U15"]
[null,"Sedlář Jan ",2010,"U13","ch","SKST Liberec","Sedlář Jan   (SKST Liberec) - U13"]
[null,"Sehnoutka Matěj  ",2008,"U15","ch","Spartak Chrastava",{"$f":"B67&\"  \"&\"(\"&F67&\")\"&\" - \"&D67","v":"Sehnoutka Matěj    (Spartak Chrastava) - U15"}]
[null,"Severýn Kryštof ",2010,{"$f":"IF(C68=\"\",\"\",IF(C68>=$C$1,\"U11\",IF(C68>=$C$1-2,\"U13\",IF(C68>=$C$1-4,\"U15\",IF(C68>=$C$1-6,\"U17\",\"U19\")))))","v":"U13"},"ch","Spartak Chrastava","Severýn Kryštof   (Spartak Chrastava) - U13"]
[null,"Stach Vojtěch ",2006,"U17","ch","STAR Turnov","Stach Vojtěch   (STAR Turnov) - U17"]
[null,"Sulovský Kryštof ",2011,"U11","ch","KMST Liberec","Sulovský Kryštof   (KMST Liberec) - U11"]
[null,"Šedo Pavel ",2005,"U17","ch","KMST Liberec","Šedo Pavel   (KMST Liberec) - U17"]
[null,"Šerpán Radek  ",2007,"U15","ch","STAR Turnov","Šerpán Radek    (STAR Turnov) - U15"]
[null,"Šťastný Jiří ",2010,"U13","ch","KMST Liberec","Šťastný Jiří   (KMST Liberec) - U13"]
[null,"Šulc Štěpán ",2009,"U13","ch","SKST Liberec","Šulc Štěpán   (SKST Liberec) - U13"]
[null,"Táborský Václav ",2009,"U13","ch","STAR Turnov","Táborský Václav   (STAR Turnov) - U13"]
[null,"Vejvoda Viktor ",2006,"U17","ch","SKST Liberec","Vejvoda Viktor   (SKST Liberec) - U17"]
[null,"Veselý Martin ",2004,"U19","ch","Kosmonosy","Veselý Martin   (Kosmonosy) - U19"]
[null,"Veselý Michal ",2007,"U15","ch","Kosmonosy","Veselý Michal   (Kosmonosy) - U15"]
[null,"Vogel Jakub  ",2006,"U17","ch","SKST Liberec","Vogel Jakub    (SKST Liberec) - U17"]
[null,"Voplakal Vojtech",2012,"U11","ch","SKST Liberec","Voplakal Vojtech  (SKST Liberec) - U11"]
[null,"Vrběcký Daniel  ",2005,"U17","ch","B.  Jablonec n. N.","Vrběcký Daniel    (B.  Jablonec n. N.) - U17"]
[null,"Vyhlídko Jan ",2005,"U17","ch","Spartak Smržovka","Vyhlídko Jan   (Spartak Smržovka) - U17"]
[null,"Wolf Filip",2008,"U15","ch","SKST Liberec","Wolf Filip  (SKST Liberec) - U15"]
[null,"Závětová Lucie ",2004,"U19","d","ST Frýdlant","Závětová Lucie   (ST Frýdlant) - U19"]
[null,"Žagan Štěpán ",2007,"U15","ch","KMST Liberec","Žagan Štěpán   (KMST Liberec) - U15"]
[null,"Žmuda Petr",2007,"U15","ch","SKST Liberec","Žmuda Petr  (SKST Liberec) - U15"]
[null,"Gabriel Jan",2007,"U15","ch","Loko Česká Lípa","Gabriel Jan  (Loko Česká Lípa) - U15"]
[null,null,null,"",null,null,"  () - "]
[null,null,null,"",null,null,"  () - "]
[null,null,null,"",null,null,"  () - "]
[null,null,null,"",null,null,"  () - "]
[null,null,null,"",null,null,"  () - "]
[null,null,null,"",null,null,"  () - "]
[null,null,null,"",null,null,"  () - "]
[null,null,null,"",null,null,"  () - "]
[null,null,null,"",null,null,"  () - "]
[null,null,null,"",null,null,"  () - "]
[null,null,null,"",null,null,"  () - "]
[null,null,null,"",null,null,{"$f":"B99&\"  \"&\"(\"&F99&\")\"&\" - \"&D99","v":"  () - "}]
[null,null,null,"",null,null,"  () - "]
[null,null,null,"",null,null,"  () - "]
[null,null,null,"",null,null,"  () - "]
[null,null,null,"",null,null,"  () - "]
[null,null,null,"",null,null,"  () - "]
[null,null,null,"",null,null,"  () - "]
[null,null,null,"",null,null,"  () - "]
[null,null,null,"",null,null,"  () - "]
[null,null,null,"",null,null,"  () - "]
[null,null,null,"",null,null,"  () - "]
[null,null,null,"",null,null,"  () - "]
[null,null,null,"",null,null,"  () - "]
[null,null,null,"",null,null,"  () - "]
[null,null,null,"",null,null,"  () - "]
[null,null,null,"",null,null,"  () - "]
[null,null,null,"",null,null,"  () - "]
[null,null,null,"",null,null,"  () - "]
[null,null,null,"",null,null,"  () - "]
[null,null,null,"",null,null,"  () - "]
[null,null,null,"",null,null,"  () - "]
[null,null,null,"",null,null,"  () - "]
[null,null,null,"",null,null,"  () - "]
[null,null,null,"",null,null,"  () - "]
[null,null,null,"",null,null,"  () - "]
[null,null,null,"",null,null,"  () - "]
[null,null,null,"",null,null,"  () - "]
[null,null,null,"",null,null,"  () - "]
[null,null,null,"",null,null,"  () - "]
[null,null,null,"",null,null,"  () - "]
[null,null,null,"",null,null,"  () - "]
[null,null,null,"",null,null,"  () - "]
[null,null,null,"",null,null,{"$f":"B131&\"  \"&\"(\"&F131&\")\"&\" - \"&D131","v":"  () - "}]
[null,null,null,{"$f":"IF(C132=\"\",\"\",IF(C132>=$C$1,\"U11\",IF(C132>=$C$1-2,\"U13\",IF(C132>=$C$1-4,\"U15\",IF(C132>=$C$1-6,\"U17\",\"U19\")))))","v":""},null,null,"  () - "]
[null,null,null,"",null,null,"  () - "]
[null,null,null,"",null,null,"  () - "]
[null,null,null,"",null,null,"  () - "]
[null,null,null,"",null,null,"  () - "]
[null,null,null,"",null,null,"  () - "]
[null,null,null,"",null,null,"  () - "]
[null,null,null,"",null,null,"  () - "]
[null,null,null,"",null,null,"  () - "]
[null,null,null,"",null,null,"  () - "]
[null,null,null,"",null,null,"  () - "]
[null,null,null,"",null,null,"  () - "]
[null,null,null,"",null,null,"  () - "]
[null,null,null,"",null,null,"  () - "]
[null,null,null,"",null,null,"  () - "]
[null,null,null,"",null,null,"  () - "]
[null,null,null,"",null,null,"  () - "]
[null,null,null,"",null,null,"  () - "]
[null,null,null,"",null,null,"  () - "]
[null,null,null,"",null,null,"  () - "]
[null,null,null,"",null,null,"  () - "]
[null,null,null,"",null,null,"  () - "]
[null,null,null,"",null,null,"  () - "]
[null,null,null,"",null,null,"  () - "]
[null,null,null,"",null,null,"  () - "]

{"sheet":"A_skupiny","index":1,"n_rows":27,"n_cols":11,"rows_kept":27,"cut":false,"hidden":false,"merged":[[0,0,0,9],[5,1,5,2],[6,1,6,2],[2,0,2,3],[3,0,3,2],[7,1,7,2],[8,1,8,2],[11,1,11,2],[12,1,12,2],[13,1,13,2],[23,1,23,2],[24,1,24,2],[25,1,25,2],[26,1,26,2],[14,1,14,2],[17,1,17,2],[18,1,18,2],[19,1,19,2],[20,1,20,2]]}
["10. KBT Libereckého kraje"]
[]
["Turnov, 14.05.2022"]
["Divize A skupina"]
[null,"skupina A","škola/klub",1,2,3,4,"sety","b","m"]
[1,"Wolf Filip  (SKST Liberec) - U15",null,"xxx","3:1","3 : 0","3 : 0",null,{"$f":"IF(B6=\"\",0,IF(E6=\"\",0,IF(OR(LEFT(E6,1)=\"w\",VALUE(LEFT(E6,1))>VALUE(RIGHT(E6,1))),2,IF(OR(VALUE(LEFT(E6,1))<VALUE(RIGHT(E6,1))),1,0)))+IF(F6=\"\",0,IF(OR(LEFT(F6,1)=\"w\",VALUE(LEFT(F6,1))>VALUE(RIGHT(F6,1))),2,IF(OR(VALUE(LEFT(F6,1))<VALUE(RIGHT(F6,1))),1,0)))+IF(G6=\"\",0,IF(OR(LEFT(G6,1)=\"w\",VALUE(LEFT(G6,1))>VALUE(RIGHT(G6,1))),2,IF(OR(VALUE(LEFT(G6,1))<VALUE(RIGHT(G6,1))),1,0))))","v":6},{"$f":"IF(I6=0,\"\",RANK(I6,$I$6:$I$9))","v":1}]
[2,"Nohejl Václav    (ST Frýdlant) - U17",null,"1:3","xxx","3 : 0","3 : 2",null,{"$f":"IF(B7=\"\",0,IF(D7=\":\",0,IF(OR(LEFT(D7,1)=\"w\",VALUE(LEFT(D7,1))>VALUE(RIGHT(D7,1))),2,IF(OR(VALUE(LEFT(D7,1))<VALUE(RIGHT(D7,1))),1,0)))+IF(F7=\"\",0,IF(OR(LEFT(F7,1)=\"w\",VALUE(LEFT(F7,1))>VALUE(RIGHT(F7,1))),2,IF(OR(VALUE(LEFT(F7,1))<VALUE(RIGHT(F7,1))),1,0)))+IF(G7=\"\",0,IF(OR(LEFT(G7,1)=\"w\",VALUE(LEFT(G7,1))>VALUE(RIGHT(G7,1))),2,IF(OR(VALUE(LEFT(G7,1))<VALUE(RIGHT(G7,1))),1,0))))","v":5},{"$f":"IF(I7=0,\"\",RANK(I7,$I$6:$I$9))","v":2}]
[3,"Kovář Samuel (SKST Liberec) - U13",null,{"$f":"RIGHT(F6,1)&\":\"&LEFT(F6,1)","v":"0:3"},{"$f":"RIGHT(F7,1)&\":\"&LEFT(F7,1)","v":"0:3"},"xxx","1 : 3",null,{"$f":"IF(B8=\"\",0,IF(D8=\":\",0,IF(OR(LEFT(D8,1)=\"w\",VALUE(LEFT(D8,1))>VALUE(RIGHT(D8,1))),2,IF(OR(VALUE(LEFT(D8,1))<VALUE(RIGHT(D8,1))),1,0)))+IF(E8=\":\",0,IF(OR(LEFT(E8,1)=\"w\",VALUE(LEFT(E8,1))>VALUE(RIGHT(E8,1))),2,IF(OR(VALUE(LEFT(E8,1))<VALUE(RIGHT(E8,1))),1,0)))+IF(G8=\"\",0,IF(OR(LEFT(G8,1)=\"w\",VALUE(LEFT(G8,1))>VALUE(RIGHT(G8,1))),2,IF(OR(VALUE(LEFT(G8,1))<VALUE(RIGHT(G8,1))),1,0))))","v":3},{"$f":"IF(I8=0,\"\",RANK(I8,$I$6:$I$9))","v":4}]
[4,"Nechvíl Richard    (Sokol Turnov) - U15",null,{"$f":"RIGHT(G6,1)&\":\"&LEFT(G6,1)","v":"0:3"},"2:3",{"$f":"RIGHT(G8,1)&\":\"&LEFT(G8,1)","v":"3:1"},"xxx",null,{"$f":"IF(B9=\"\",0,IF(D9=\":\",0,IF(OR(LEFT(D9,1)=\"w\",VALUE(LEFT(D9,1))>VALUE(RIGHT(D9,1))),2,IF(OR(VALUE(LEFT(D9,1))<VALUE(RIGHT(D9,1))),1,0)))+IF(E9=\":\",0,IF(OR(LEFT(E9,1)=\"w\",VALUE(LEFT(E9,1))>VALUE(RIGHT(E9,1))),2,IF(OR(VALUE(LEFT(E9,1))<VALUE(RIGHT(E9,1))),1,0)))+IF(F9=\":\",0,IF(OR(LEFT(F9,1)=\"w\",VALUE(LEFT(F9,1))>VALUE(RIGHT(F9,1))),2,IF(OR(VALUE(LEFT(F9,1))<VALUE(RIGHT(F9,1))),1,0))))","v":4},{"$f":"IF(I9=0,\"\",RANK(I9,$I$6:$I$9))","v":3}]
[]
[null,"skupina B","škola/klub",1,2,3,4,"sety","b","m"]
[1,"Němec Štěpán    (SKST Liberec) - U15",null,"xxx","3:1","3:0","3:0",null,{"$f":"IF(B12=\"\",0,IF(E12=\"\",0,IF(OR(LEFT(E12,1)=\"w\",VALUE(LEFT(E12,1))>VALUE(RIGHT(E12,1))),2,IF(OR(VALUE(LEFT(E12,1))<VALUE(RIGHT(E12,1))),1,0)))+IF(F12=\"\",0,IF(OR(LEFT(F12,1)=\"w\",VALUE(LEFT(F12,1))>VALUE(RIGHT(F12,1))),2,IF(OR(VALUE(LEFT(F12,1))<VALUE(RIGHT(F12,1))),1,0)))+IF(G12=\"\",0,IF(OR(LEFT(G12,1)=\"w\",VALUE(LEFT(G12,1))>VALUE(RIGHT(G12,1))),2,IF(OR(VALUE(LEFT(G12,1))<VALUE(RIGHT(G12,1))),1,0))))","v":6},{"$f":"IF(I12=0,\"\",RANK(I12,$I$12:$I$15))","v":1}]
[2,"Nohejl Matěj (ST Frýdlant) - U17",null,"1:3","xxx","3:1","3:1",null,{"$f":"IF(B13=\"\",0,IF(D13=\":\",0,IF(OR(LEFT(D13,1)=\"w\",VALUE(LEFT(D13,1))>VALUE(RIGHT(D13,1))),2,IF(OR(VALUE(LEFT(D13,1))<VALUE(RIGHT(D13,1))),1,0)))+IF(F13=\"\",0,IF(OR(LEFT(F13,1)=\"w\",VALUE(LEFT(F13,1))>VALUE(RIGHT(F13,1))),2,IF(OR(VALUE(LEFT(F13,1))<VALUE(RIGHT(F13,1))),1,0)))+IF(G13=\"\",0,IF(OR(LEFT(G13,1)=\"w\",VALUE(LEFT(G13,1))>VALUE(RIGHT(G13,1))),2,IF(OR(VALUE(LEFT(G13,1))<VALUE(RIGHT(G13,1))),1,0))))","v":5},{"$f":"IF(I13=0,\"\",RANK(I13,$I$12:$I$15))","v":2}]
[3,"Pytlounová Nikola (SKST Liberec) - U15",null,{"$f":"RIGHT(F12,1)&\":\"&LEFT(F12,1)","v":"0:3"},{"$f":"RIGHT(F13,1)&\":\"&LEFT(F13,1)","v":"1:3"},"xxx","3:0",null,{"$f":"IF(B14=\"\",0,IF(D14=\":\",0,IF(OR(LEFT(D14,1)=\"w\",VALUE(LEFT(D14,1))>VALUE(RIGHT(D14,1))),2,IF(OR(VALUE(LEFT(D14,1))<VALUE(RIGHT(D14,1))),1,0)))+IF(E14=\":\",0,IF(OR(LEFT(E14,1)=\"w\",VALUE(LEFT(E14,1))>VALUE(RIGHT(E14,1))),2,IF(OR(VALUE(LEFT(E14,1))<VALUE(RIGHT(E14,1))),1,0)))+IF(G14=\"\",0,IF(OR(LEFT(G14,1)=\"w\",VALUE(LEFT(G14,1))>VALUE(RIGHT(G14,1))),2,IF(OR(VALUE(LEFT(G14,1))<VALUE(RIGHT(G14,1))),1,0))))","v":4},{"$f":"IF(I14=0,\"\",RANK(I14,$I$12:$I$15))","v":3}]
[4,"Rek Vít  (Loko Česká Lípa) - U13",null,{"$f":"RIGHT(G12,1)&\":\"&LEFT(G12,1)","v":"0:3"},{"$f":"RIGHT(G13,1)&\":\"&LEFT(G13,1)","v":"1:3"},{"$f":"RIGHT(G14,1)&\":\"&LEFT(G14,1)","v":"0:3"},"xxx",null,{"$f":"IF(B15=\"\",0,IF(D15=\":\",0,IF(OR(LEFT(D15,1)=\"w\",VALUE(LEFT(D15,1))>VALUE(RIGHT(D15,1))),2,IF(OR(VALUE(LEFT(D15,1))<VALUE(RIGHT(D15,1))),1,0)))+IF(E15=\":\",0,IF(OR(LEFT(E15,1)=\"w\",VALUE(LEFT(E15,1))>VALUE(RIGHT(E15,1))),2,IF(OR(VALUE(LEFT(E15,1))<VALUE(RIGHT(E15,1))),1,0)))+IF(F15=\":\",0,IF(OR(LEFT(F15,1)=\"w\",VALUE(LEFT(F15,1))>VALUE(RIGHT(F15,1))),2,IF(OR(VALUE(LEFT(F15,1))<VALUE(RIGHT(F15,1))),1,0))))","v":3},{"$f":"IF(I15=0,\"\",RANK(I15,$I$12:$I$15))","v":4}]
[]
[null,"Skupina C","škola/klub",1,2,3,4,"sety","b","m"]
[1,"Žmuda Petr  (SKST Liberec) - U15",null,"xxx","3:1","3:0","3:0",null,{"$f":"IF(B18=\"\",0,IF(E18=\"\",0,IF(OR(LEFT(E18,1)=\"w\",VALUE(LEFT(E18,1))>VALUE(RIGHT(E18,1))),2,IF(OR(VALUE(LEFT(E18,1))<VALUE(RIGHT(E18,1))),1,0)))+IF(F18=\"\",0,IF(OR(LEFT(F18,1)=\"w\",VALUE(LEFT(F18,1))>VALUE(RIGHT(F18,1))),2,IF(OR(VALUE(LEFT(F18,1))<VALUE(RIGHT(F18,1))),1,0)))+IF(G18=\"\",0,IF(OR(LEFT(G18,1)=\"w\",VALUE(LEFT(G18,1))>VALUE(RIGHT(G18,1))),2,IF(OR(VALUE(LEFT(G18,1))<VALUE(RIGHT(G18,1))),1,0))))","v":6},{"$f":"IF(I18=0,\"\",RANK(I18,$I$18:$I$21))","v":1}]
[2,"Nohejl Martin   (ST Frýdlant) - U17",null,{"$f":"RIGHT(E18,1)&\":\"&LEFT(E18,1)","v":"1:3"},"xxx","3:0","3:1",null,{"$f":"IF(B19=\"\",0,IF(D19=\":\",0,IF(OR(LEFT(D19,1)=\"w\",VALUE(LEFT(D19,1))>VALUE(RIGHT(D19,1))),2,IF(OR(VALUE(LEFT(D19,1))<VALUE(RIGHT(D19,1))),1,0)))+IF(F19=\"\",0,IF(OR(LEFT(F19,1)=\"w\",VALUE(LEFT(F19,1))>VALUE(RIGHT(F19,1))),2,IF(OR(VALUE(LEFT(F19,1))<VALUE(RIGHT(F19,1))),1,0)))+IF(G19=\"\",0,IF(OR(LEFT(G19,1)=\"w\",VALUE(LEFT(G19,1))>VALUE(RIGHT(G19,1))),2,IF(OR(VALUE(LEFT(G19,1))<VALUE(RIGHT(G19,1))),1,0))))","v":5},{"$f":"IF(I19=0,\"\",RANK(I19,$I$18:$I$21))","v":2}]
[3,"Brož Kryštof (STAR Turnov (- U17",null,{"$f":"RIGHT(F18,1)&\":\"&LEFT(F18,1)","v":"0:3"},{"$f":"RIGHT(F19,1)&\":\"&LEFT(F19,1)","v":"0:3"},"xxx","3:1",null,{"$f":"IF(B20=\"\",0,IF(D20=\":\",0,IF(OR(LEFT(D20,1)=\"w\",VALUE(LEFT(D20,1))>VALUE(RIGHT(D20,1))),2,IF(OR(VALUE(LEFT(D20,1))<VALUE(RIGHT(D20,1))),1,0)))+IF(E20=\":\",0,IF(OR(LEFT(E20,1)=\"w\",VALUE(LEFT(E20,1))>VALUE(RIGHT(E20,1))),2,IF(OR(VALUE(LEFT(E20,1))<VALUE(RIGHT(E20,1))),1,0)))+IF(G20=\"\",0,IF(OR(LEFT(G20,1)=\"w\",VALUE(LEFT(G20,1))>VALUE(RIGHT(G20,1))),2,IF(OR(VALUE(LEFT(G20,1))<VALUE(RIGHT(G20,1))),1,0))))","v":4},{"$f":"IF(I20=0,\"\",RANK(I20,$I$18:$I$21))","v":3}]
[4,"Nováková Tereza    (Spartak Chrastava) - U17",null,{"$f":"RIGHT(G18,1)&\":\"&LEFT(G18,1)","v":"0:3"},{"$f":"RIGHT(G19,1)&\":\"&LEFT(G19,1)","v":"1:3"},{"$f":"RIGHT(G20,1)&\":\"&LEFT(G20,1)","v":"1:3"},"xxx",null,{"$f":"IF(B21=\"\",0,IF(D21=\":\",0,IF(OR(LEFT(D21,1)=\"w\",VALUE(LEFT(D21,1))>VALUE(RIGHT(D21,1))),2,IF(OR(VALUE(LEFT(D21,1))<VALUE(RIGHT(D21,1))),1,0)))+IF(E21=\":\",0,IF(OR(LEFT(E21,1)=\"w\",VALUE(LEFT(E21,1))>VALUE(RIGHT(E21,1))),2,IF(OR(VALUE(LEFT(E21,1))<VALUE(RIGHT(E21,1))),1,0)))+IF(F21=\":\",0,IF(OR(LEFT(F21,1)=\"w\",VALUE(LEFT(F21,1))>VALUE(RIGHT(F21,1))),2,IF(OR(VALUE(LEFT(F21,1))<VALUE(RIGHT(F21,1))),1,0))))","v":3},{"$f":"IF(I21=0,\"\",RANK(I21,$I$18:$I$21))","v":4}]
[]
[null,"Skupina D","škola/klub",1,2,3,4,"sety","b","m"]
[1,"Vogel Jakub    (SKST Liberec) - U17",null,"xxx","3:2","3:2","2:3",null,{"$f":"IF(B24=\"\",0,IF(E24=\"\",0,IF(OR(LEFT(E24,1)=\"w\",VALUE(LEFT(E24,1))>VALUE(RIGHT(E24,1))),2,IF(OR(VALUE(LEFT(E24,1))<VALUE(RIGHT(E24,1))),1,0)))+IF(F24=\"\",0,IF(OR(LEFT(F24,1)=\"w\",VALUE(LEFT(F24,1))>VALUE(RIGHT(F24,1))),2,IF(OR(VALUE(LEFT(F24,1))<VALUE(RIGHT(F24,1))),1,0)))+IF(G24=\"\",0,IF(OR(LEFT(G24,1)=\"w\",VALUE(LEFT(G24,1))>VALUE(RIGHT(G24,1))),2,IF(OR(VALUE(LEFT(G24,1))<VALUE(RIGHT(G24,1))),1,0))))","v":5},2,"5:5"]
[2,"Csizmazia Antonín   (Sokol Turnov) - U11",null,{"$f":"RIGHT(E24,1)&\":\"&LEFT(E24,1)","v":"2:3"},"xxx","1:3","2:3",null,{"$f":"IF(B25=\"\",0,IF(D25=\":\",0,IF(OR(LEFT(D25,1)=\"w\",VALUE(LEFT(D25,1))>VALUE(RIGHT(D25,1))),2,IF(OR(VALUE(LEFT(D25,1))<VALUE(RIGHT(D25,1))),1,0)))+IF(F25=\"\",0,IF(OR(LEFT(F25,1)=\"w\",VALUE(LEFT(F25,1))>VALUE(RIGHT(F25,1))),2,IF(OR(VALUE(LEFT(F25,1))<VALUE(RIGHT(F25,1))),1,0)))+IF(G25=\"\",0,IF(OR(LEFT(G25,1)=\"w\",VALUE(LEFT(G25,1))>VALUE(RIGHT(G25,1))),2,IF(OR(VALUE(LEFT(G25,1))<VALUE(RIGHT(G25,1))),1,0))))","v":3},{"$f":"IF(I25=0,\"\",RANK(I25,$I$24:$I$27))","v":4}]
[3,"Jandák Jan (SKT Liberec) - U19",null,{"$f":"RIGHT(F24,1)&\":\"&LEFT(F24,1)","v":"2:3"},{"$f":"RIGHT(F25,1)&\":\"&LEFT(F25,1)","v":"3:1"},"xxx","3:1",null,{"$f":"IF(B26=\"\",0,IF(D26=\":\",0,IF(OR(LEFT(D26,1)=\"w\",VALUE(LEFT(D26,1))>VALUE(RIGHT(D26,1))),2,IF(OR(VALUE(LEFT(D26,1))<VALUE(RIGHT(D26,1))),1,0)))+IF(E26=\":\",0,IF(OR(LEFT(E26,1)=\"w\",VALUE(LEFT(E26,1))>VALUE(RIGHT(E26,1))),2,IF(OR(VALUE(LEFT(E26,1))<VALUE(RIGHT(E26,1))),1,0)))+IF(G26=\"\",0,IF(OR(LEFT(G26,1)=\"w\",VALUE(LEFT(G26,1))>VALUE(RIGHT(G26,1))),2,IF(OR(VALUE(LEFT(G26,1))<VALUE(RIGHT(G26,1))),1,0))))","v":5},{"$f":"IF(I26=0,\"\",RANK(I26,$I$24:$I$27))","v":1},"5:4"]
[4,"Smékla Jiří (/TTC Bělá p.B.) - U15",null,{"$f":"RIGHT(G24,1)&\":\"&LEFT(G24,1)","v":"3:2"},{"$f":"RIGHT(G25,1)&\":\"&LEFT(G25,1)","v":"3:2"},{"$f":"RIGHT(G26,1)&\":\"&LEFT(G26,1)","v":"1:3"},"xxx",null,{"$f":"IF(B27=\"\",0,IF(D27=\":\",0,IF(OR(LEFT(D27,1)=\"w\",VALUE(LEFT(D27,1))>VALUE(RIGHT(D27,1))),2,IF(OR(VALUE(LEFT(D27,1))<VALUE(RIGHT(D27,1))),1,0)))+IF(E27=\":\",0,IF(OR(LEFT(E27,1)=\"w\",VALUE(LEFT(E27,1))>VALUE(RIGHT(E27,1))),2,IF(OR(VALUE(LEFT(E27,1))<VALUE(RIGHT(E27,1))),1,0)))+IF(F27=\":\",0,IF(OR(LEFT(F27,1)=\"w\",VALUE(LEFT(F27,1))>VALUE(RIGHT(F27,1))),2,IF(OR(VALUE(LEFT(F27,1))<VALUE(RIGHT(F27,1))),1,0))))","v":5},3,"4:5"]

{"sheet":"A_finale","index":2,"n_rows":40,"n_cols":4,"rows_kept":40,"cut":false,"hidden":false,"merged":[[0,1,0,2],[1,1,1,2],[2,1,2,2],[3,1,3,2]]}
["Název soutěže:",{"$f":"A_skupiny!A1","v":"10. KBT Libereckého kraje"}]
[]
["Kategorie, den",{"$f":"A_skupiny!A3","v":"Turnov, 14.05.2022"}]
["Kolo","Divize A finále"]
[]
[{"$f":"'1divize-A'!A5","v":"o 1.-8. místo"}]
["Wolf Filip  (SKST Liberec) - U15"]
[null,"Wolf Filip  (SKST Liberec) - U15"]
["Vogel Jakub    (SKST Liberec) - U17","3:2"]
[null,null,{"$f":"'1divize-A'!A23","v":"Wolf Filip  (SKST Liberec) - U15"}]
["Nohejl Matěj (ST Frýdlant) - U17",null,"3:0"]
[null,"Žmuda Petr (SKST Liberec) - U15"]
["Žmuda Petr (SKST Liberec) - U15",{"$f":"IF('1divize-A'!D7=\"\",\"\",IF(LEFT('1divize-A'!D7,1)>RIGHT('1divize-A'!D7,1),'1divize-A'!D7,RIGHT('1divize-A'!D7,1)&\":\"&LEFT('1divize-A'!D7,1)))","v":"3:0"}]
[null,null,null,"Němec Štěpán (SKST Liberec) - U15"]
["Jandák Jan (SKST Liberec) - U19",null,null,"3:1"]
[null,"Nohejl Václav (ST Frýdlant) - U17"]
["Nohejl Václav (ST Frýdlant) - U17","3:0"]
[null,null,"Němec Štěpán (SKST Liberec) - U15"]
["Nohejl Martin (ST Frýdlant) -U17",null,"3:2"]
[null,"Němec Štěpán (SKST Liberec) - U15"]
["Němec Štěpán (SKST Liberec) - U15","3:0"]
[]
[{"$f":"'1divize-A'!A10","v":"o 5.-8. místo"}]
["Vogel Jakub    (SKST Liberec) - U17",null,{"$f":"IF('1divize-A'!D57=\"\",\"\",IF(LEFT('1divize-A'!D57,1)>RIGHT('1divize-A'!D57,1),'1divize-A'!D57,RIGHT('1divize-A'!D57,1)&\":\"&LEFT('1divize-A'!D57,1)))","v":""}]
[null,"Nohejl Matěj (ST Frýdlant) - U17"]
["Nohejl Matěj (ST Frýdlant) - U17","3:1"]
[null,null,"Nohejl Martin (ST Frýdlant) -U17"]
["Jandák Jan (SKST Liberec) - U19",null,"3:1"]
[null,"Nohejl Martin (ST Frýdlant) -U17"]
["Nohejl Martin (ST Frýdlant) -U17","3:1"]
[]
[{"$f":"'1divize-A'!A13","v":"o 3.-4. místo"}]
["Žmuda Petr (SKST Liberec) - U15"]
[null,{"$f":"'1divize-A'!A26","v":"Žmuda Petr  (SKST Liberec) - U15"}]
["Nohejl Václav (ST Frýdlant) - U17","3:2"]
[]
[{"$f":"'1divize-A'!A15","v":"o 7.-8. místo"}]
["Vogel Jakub    (SKST Liberec) - U17"]
[null,{"$f":"'1divize-A'!A30","v":"Gabriel Jan  (Loko Česká Lípa) - U15"}]
["Jandák Jan (SKST Liberec) - U19",{"$f":"IF('1divize-A'!D16=\"\",\"\",IF(LEFT('1divize-A'!D16,1)>RIGHT('1divize-A'!D16,1),'1divize-A'!D16,RIGHT('1divize-A'!D16,1)&\":\"&LEFT('1divize-A'!D16,1)))","v":"3:1"}]

{"sheet":"A_utecha","index":3,"n_rows":40,"n_cols":4,"rows_kept":40,"cut":false,"hidden":false,"merged":[[0,1,0,2],[1,1,1,2],[2,1,2,2],[3,1,3,2]]}
["Název soutěže:",{"$f":"A_skupiny!A1","v":"10. KBT Libereckého kraje"}]
[]
["Kategorie, den",{"$f":"A_skupiny!A3","v":"Turnov, 14.05.2022"}]
["Kolo","Divize A útěcha"]
[]
[{"$f":"'1divize-B'!A5","v":"o 9.-16. místo"}]
["Nechvíl Richard    (Sokol Turnov) - U15"]
[null,"Nechvíl Richard    (Sokol Turnov) - U15"]
[{"$f":"IF('2divize-A'!C6=\"\",\"\",'2divize-A'!C6)","v":"Rek Vít    (Loko Česká Lípa) - U13"},"3:0"]
[null,null,"Nováková Tereza (Spartak Chrastava¨- U17"]
["Nováková Tereza (Spartak Chrastava¨- U17",null,"3:0"]
[null,"Nováková Tereza (Spartak Chrastava¨- U17"]
["Smékal Jižří (TTC Bělá p.B.) - U15","3:1"]
[null,null,null,"Nováková Tereza (Spartak Chrastava¨- U17"]
["Brož Kryštof (STAR Turnov) - U17",null,null,{"$f":"IF('1divize-B'!D23=\"\",\"\",IF(LEFT('1divize-B'!D23,1)>RIGHT('1divize-B'!D23,1),'1divize-B'!D23,RIGHT('1divize-B'!D23,1)&\":\"&LEFT('1divize-B'!D23,1)))","v":"3:1"}]
[null,"Kovář Samuel (SKST Liberec) - U13"]
["Kovář Samuel (SKST Liberec) - U13","3:0"]
[null,null,"Kovář Samuel (SKST Liberec) - U13"]
["Csizmazia Asntonín (Sokol Turnov) - U11",null,{"$f":"IF('1divize-B'!D19=\"\",\"\",IF(LEFT('1divize-B'!D19,1)>RIGHT('1divize-B'!D19,1),'1divize-B'!D19,RIGHT('1divize-B'!D19,1)&\":\"&LEFT('1divize-B'!D19,1)))","v":"3:1"}]
[null,"Pytlounová Nikola (SKST Liberec) - U15"]
["Pytlounová Nikola (SKST Liberec) - U15","3:0"]
[]
[{"$f":"'1divize-B'!A10","v":"o 13.-16. místo"}]
["Rek Vít (Loko Česká Lípa) - U13",null,{"$f":"IF('1divize-B'!D57=\"\",\"\",IF(LEFT('1divize-B'!D57,1)>RIGHT('1divize-B'!D57,1),'1divize-B'!D57,RIGHT('1divize-B'!D57,1)&\":\"&LEFT('1divize-B'!D57,1)))","v":""}]
[null,"Smékal Jiří (TTC Bělá p.B.) - U15"]
["Smékal Jiří (TTC Bělá p.B.) - U15",{"$f":"IF('1divize-B'!D11=\"\",\"\",IF(LEFT('1divize-B'!D11,1)>RIGHT('1divize-B'!D11,1),'1divize-B'!D11,RIGHT('1divize-B'!D11,1)&\":\"&LEFT('1divize-B'!D11,1)))","v":"3:2"}]
[null,null,"Smékal Jiří (TTC Bělá p.B.) - U15"]
["Brož Kryštof (STAR Turnov) - U17",null,"3:1"]
[null,"Brož Kryštof (STAR Turnov) - U17"]
["Csizmazia Asntonín (Sokol Turnov) - U11","3:0"]
[]
[{"$f":"'1divize-B'!A13","v":"o 11.-12. místo"}]
["Nechvíl Richard    (Sokol Turnov) - U15"]
[null,"Nechvíl Richard    (Sokol Turnov) - U15"]
["Pytlounová Nikola (SKST Liberec) - U15",{"$f":"IF('1divize-B'!D14=\"\",\"\",IF(LEFT('1divize-B'!D14,1)>RIGHT('1divize-B'!D14,1),'1divize-B'!D14,RIGHT('1divize-B'!D14,1)&\":\"&LEFT('1divize-B'!D14,1)))","v":"3:0"}]
[]
[{"$f":"'1divize-B'!A15","v":"o 15.-16. místo"}]
["Rek Vít (Loko Česká Lípa) - U13"]
[null,"Csizmazia Asntonín (Sokol Turnov) - U11"]
["Csizmazia Asntonín (Sokol Turnov) - U11",{"$f":"IF('1divize-B'!D16=\"\",\"\",IF(LEFT('1divize-B'!D16,1)>RIGHT('1divize-B'!D16,1),'1divize-B'!D16,RIGHT('1divize-B'!D16,1)&\":\"&LEFT('1divize-B'!D16,1)))","v":"3:0"}]

{"sheet":"B_skupiny","index":4,"n_rows":27,"n_cols":12,"rows_kept":27,"cut":false,"hidden":false,"merged":[[7,1,7,2],[0,0,0,9],[5,1,5,2],[6,1,6,2],[2,0,2,3],[3,0,3,2],[26,1,26,2],[25,1,25,2],[8,1,8,2],[11,1,11,2],[12,1,12,2],[13,1,13,2],[14,1,14,2],[17,1,17,2],[18,1,18,2],[19,1,19,2],[20,1,20,2],[23,1,23,2],[24,1,24,2]]}
[{"$f":"A_skupiny!A1","v":"10. KBT Libereckého kraje"}]
[]
[{"$f":"A_skupiny!A3","v":"Turnov, 14.05.2022"}]
["Divize B skupiny"]
[null,"skupina E","škola/klub",1,2,3,4,"sety","b","m"]
[1,"Šedo Pavel   (KMST Liberec) - U17",null,"xxx","3:1","3:0","3:0",null,{"$f":"IF(B6=\"\",0,IF(E6=\"\",0,IF(OR(LEFT(E6,1)=\"w\",VALUE(LEFT(E6,1))>VALUE(RIGHT(E6,1))),2,IF(OR(VALUE(LEFT(E6,1))<VALUE(RIGHT(E6,1))),1,0)))+IF(F6=\"\",0,IF(OR(LEFT(F6,1)=\"w\",VALUE(LEFT(F6,1))>VALUE(RIGHT(F6,1))),2,IF(OR(VALUE(LEFT(F6,1))<VALUE(RIGHT(F6,1))),1,0)))+IF(G6=\"\",0,IF(OR(LEFT(G6,1)=\"w\",VALUE(LEFT(G6,1))>VALUE(RIGHT(G6,1))),2,IF(OR(VALUE(LEFT(G6,1))<VALUE(RIGHT(G6,1))),1,0))))","v":6},{"$f":"IF(I6=0,\"\",RANK(I6,$I$6:$I$9))","v":1}]
[2,"Košťák Matěj   (B.  Jablonec n. N.) - U15",null,{"$f":"RIGHT(E6,1)&\":\"&LEFT(E6,1)","v":"1:3"},"xxx","3:1","3:2",null,{"$f":"IF(B7=\"\",0,IF(D7=\":\",0,IF(OR(LEFT(D7,1)=\"w\",VALUE(LEFT(D7,1))>VALUE(RIGHT(D7,1))),2,IF(OR(VALUE(LEFT(D7,1))<VALUE(RIGHT(D7,1))),1,0)))+IF(F7=\"\",0,IF(OR(LEFT(F7,1)=\"w\",VALUE(LEFT(F7,1))>VALUE(RIGHT(F7,1))),2,IF(OR(VALUE(LEFT(F7,1))<VALUE(RIGHT(F7,1))),1,0)))+IF(G7=\"\",0,IF(OR(LEFT(G7,1)=\"w\",VALUE(LEFT(G7,1))>VALUE(RIGHT(G7,1))),2,IF(OR(VALUE(LEFT(G7,1))<VALUE(RIGHT(G7,1))),1,0))))","v":5},{"$f":"IF(I7=0,\"\",RANK(I7,$I$6:$I$9))","v":2}]
[3,"Günter Tomáš (KMST Liberec) - U13",null,{"$f":"RIGHT(F6,1)&\":\"&LEFT(F6,1)","v":"0:3"},{"$f":"RIGHT(F7,1)&\":\"&LEFT(F7,1)","v":"1:3"},"xxx","1:3",null,{"$f":"IF(B8=\"\",0,IF(D8=\":\",0,IF(OR(LEFT(D8,1)=\"w\",VALUE(LEFT(D8,1))>VALUE(RIGHT(D8,1))),2,IF(OR(VALUE(LEFT(D8,1))<VALUE(RIGHT(D8,1))),1,0)))+IF(E8=\":\",0,IF(OR(LEFT(E8,1)=\"w\",VALUE(LEFT(E8,1))>VALUE(RIGHT(E8,1))),2,IF(OR(VALUE(LEFT(E8,1))<VALUE(RIGHT(E8,1))),1,0)))+IF(G8=\"\",0,IF(OR(LEFT(G8,1)=\"w\",VALUE(LEFT(G8,1))>VALUE(RIGHT(G8,1))),2,IF(OR(VALUE(LEFT(G8,1))<VALUE(RIGHT(G8,1))),1,0))))","v":3},{"$f":"IF(I8=0,\"\",RANK(I8,$I$6:$I$9))","v":4}]
[4,"Adamíra Šimon (Orel Lomnice) - U15",null,{"$f":"RIGHT(G6,1)&\":\"&LEFT(G6,1)","v":"0:3"},{"$f":"RIGHT(G7,1)&\":\"&LEFT(G7,1)","v":"2:3"},{"$f":"RIGHT(G8,1)&\":\"&LEFT(G8,1)","v":"3:1"},"xxx",null,{"$f":"IF(B9=\"\",0,IF(D9=\":\",0,IF(OR(LEFT(D9,1)=\"w\",VALUE(LEFT(D9,1))>VALUE(RIGHT(D9,1))),2,IF(OR(VALUE(LEFT(D9,1))<VALUE(RIGHT(D9,1))),1,0)))+IF(E9=\":\",0,IF(OR(LEFT(E9,1)=\"w\",VALUE(LEFT(E9,1))>VALUE(RIGHT(E9,1))),2,IF(OR(VALUE(LEFT(E9,1))<VALUE(RIGHT(E9,1))),1,0)))+IF(F9=\":\",0,IF(OR(LEFT(F9,1)=\"w\",VALUE(LEFT(F9,1))>VALUE(RIGHT(F9,1))),2,IF(OR(VALUE(LEFT(F9,1))<VALUE(RIGHT(F9,1))),1,0))))","v":4},{"$f":"IF(I9=0,\"\",RANK(I9,$I$6:$I$9))","v":3}]
[]
[null,"skupina F","škola/klub",1,2,3,4,"sety","b","m"]
[1,"Kuntoš Filip   (SKST Liberec) - U17",null,"xxx","0:3","1:3","3:2",null,{"$f":"IF(B12=\"\",0,IF(E12=\"\",0,IF(OR(LEFT(E12,1)=\"w\",VALUE(LEFT(E12,1))>VALUE(RIGHT(E12,1))),2,IF(OR(VALUE(LEFT(E12,1))<VALUE(RIGHT(E12,1))),1,0)))+IF(F12=\"\",0,IF(OR(LEFT(F12,1)=\"w\",VALUE(LEFT(F12,1))>VALUE(RIGHT(F12,1))),2,IF(OR(VALUE(LEFT(F12,1))<VALUE(RIGHT(F12,1))),1,0)))+IF(G12=\"\",0,IF(OR(LEFT(G12,1)=\"w\",VALUE(LEFT(G12,1))>VALUE(RIGHT(G12,1))),2,IF(OR(VALUE(LEFT(G12,1))<VALUE(RIGHT(G12,1))),1,0))))","v":4},3,"4:5"]
[2,"Nypl Patrik (bižu Jablonec) - U13",null,{"$f":"RIGHT(E12,1)&\":\"&LEFT(E12,1)","v":"3:0"},"xxx","3:0","3:0",null,{"$f":"IF(B13=\"\",0,IF(D13=\":\",0,IF(OR(LEFT(D13,1)=\"w\",VALUE(LEFT(D13,1))>VALUE(RIGHT(D13,1))),2,IF(OR(VALUE(LEFT(D13,1))<VALUE(RIGHT(D13,1))),1,0)))+IF(F13=\"\",0,IF(OR(LEFT(F13,1)=\"w\",VALUE(LEFT(F13,1))>VALUE(RIGHT(F13,1))),2,IF(OR(VALUE(LEFT(F13,1))<VALUE(RIGHT(F13,1))),1,0)))+IF(G13=\"\",0,IF(OR(LEFT(G13,1)=\"w\",VALUE(LEFT(G13,1))>VALUE(RIGHT(G13,1))),2,IF(OR(VALUE(LEFT(G13,1))<VALUE(RIGHT(G13,1))),1,0))))","v":6},1]
[3,"Voplakal Vojktěch (SKST liberec) - U11",null,{"$f":"RIGHT(F12,1)&\":\"&LEFT(F12,1)","v":"3:1"},{"$f":"RIGHT(F13,1)&\":\"&LEFT(F13,1)","v":"0:3"},"xxx","0:3",null,{"$f":"IF(B14=\"\",0,IF(D14=\":\",0,IF(OR(LEFT(D14,1)=\"w\",VALUE(LEFT(D14,1))>VALUE(RIGHT(D14,1))),2,IF(OR(VALUE(LEFT(D14,1))<VALUE(RIGHT(D14,1))),1,0)))+IF(E14=\":\",0,IF(OR(LEFT(E14,1)=\"w\",VALUE(LEFT(E14,1))>VALUE(RIGHT(E14,1))),2,IF(OR(VALUE(LEFT(E14,1))<VALUE(RIGHT(E14,1))),1,0)))+IF(G14=\"\",0,IF(OR(LEFT(G14,1)=\"w\",VALUE(LEFT(G14,1))>VALUE(RIGHT(G14,1))),2,IF(OR(VALUE(LEFT(G14,1))<VALUE(RIGHT(G14,1))),1,0))))","v":4},4,"3:4"]
[4,"Korpová Tereza   (AST Kamenický Šenov) - U11",null,{"$f":"RIGHT(G12,1)&\":\"&LEFT(G12,1)","v":"2:3"},{"$f":"RIGHT(G13,1)&\":\"&LEFT(G13,1)","v":"0:3"},{"$f":"RIGHT(G14,1)&\":\"&LEFT(G14,1)","v":"3:0"},"xxx",null,{"$f":"IF(B15=\"\",0,IF(D15=\":\",0,IF(OR(LEFT(D15,1)=\"w\",VALUE(LEFT(D15,1))>VALUE(RIGHT(D15,1))),2,IF(OR(VALUE(LEFT(D15,1))<VALUE(RIGHT(D15,1))),1,0)))+IF(E15=\":\",0,IF(OR(LEFT(E15,1)=\"w\",VALUE(LEFT(E15,1))>VALUE(RIGHT(E15,1))),2,IF(OR(VALUE(LEFT(E15,1))<VALUE(RIGHT(E15,1))),1,0)))+IF(F15=\":\",0,IF(OR(LEFT(F15,1)=\"w\",VALUE(LEFT(F15,1))>VALUE(RIGHT(F15,1))),2,IF(OR(VALUE(LEFT(F15,1))<VALUE(RIGHT(F15,1))),1,0))))","v":4},2,"5:3"]
[]
[null,"Skupina G","škola/klub",1,2,3,4,"sety","b","m"]
[1,"Závětová Lucie (ST Frýdlant) - U19",null,"xxx","2:3","3:0","3:0",null,{"$f":"IF(B18=\"\",0,IF(E18=\"\",0,IF(OR(LEFT(E18,1)=\"w\",VALUE(LEFT(E18,1))>VALUE(RIGHT(E18,1))),2,IF(OR(VALUE(LEFT(E18,1))<VALUE(RIGHT(E18,1))),1,0)))+IF(F18=\"\",0,IF(OR(LEFT(F18,1)=\"w\",VALUE(LEFT(F18,1))>VALUE(RIGHT(F18,1))),2,IF(OR(VALUE(LEFT(F18,1))<VALUE(RIGHT(F18,1))),1,0)))+IF(G18=\"\",0,IF(OR(LEFT(G18,1)=\"w\",VALUE(LEFT(G18,1))>VALUE(RIGHT(G18,1))),2,IF(OR(VALUE(LEFT(G18,1))<VALUE(RIGHT(G18,1))),1,0))))","v":5},{"$f":"IF(I18=0,\"\",RANK(I18,$I$18:$I$21))","v":2}]
[2,"Bartoň David    (SKST Liberec) - U15",null,{"$f":"RIGHT(E18,1)&\":\"&LEFT(E18,1)","v":"3:2"},"xxx","3:0","3:1",null,{"$f":"IF(B19=\"\",0,IF(D19=\":\",0,IF(OR(LEFT(D19,1)=\"w\",VALUE(LEFT(D19,1))>VALUE(RIGHT(D19,1))),2,IF(OR(VALUE(LEFT(D19,1))<VALUE(RIGHT(D19,1))),1,0)))+IF(F19=\"\",0,IF(OR(LEFT(F19,1)=\"w\",VALUE(LEFT(F19,1))>VALUE(RIGHT(F19,1))),2,IF(OR(VALUE(LEFT(F19,1))<VALUE(RIGHT(F19,1))),1,0)))+IF(G19=\"\",0,IF(OR(LEFT(G19,1)=\"w\",VALUE(LEFT(G19,1))>VALUE(RIGHT(G19,1))),2,IF(OR(VALUE(LEFT(G19,1))<VALUE(RIGHT(G19,1))),1,0))))","v":6},{"$f":"IF(I19=0,\"\",RANK(I19,$I$18:$I$21))","v":1}]
[3,"Kubíček Tomáš   (STAR Turnov) - U15",null,{"$f":"RIGHT(F18,1)&\":\"&LEFT(F18,1)","v":"0:3"},{"$f":"RIGHT(F19,1)&\":\"&LEFT(F19,1)","v":"0:3"},"xxx","1:3",null,{"$f":"IF(B20=\"\",0,IF(D20=\":\",0,IF(OR(LEFT(D20,1)=\"w\",VALUE(LEFT(D20,1))>VALUE(RIGHT(D20,1))),2,IF(OR(VALUE(LEFT(D20,1))<VALUE(RIGHT(D20,1))),1,0)))+IF(E20=\":\",0,IF(OR(LEFT(E20,1)=\"w\",VALUE(LEFT(E20,1))>VALUE(RIGHT(E20,1))),2,IF(OR(VALUE(LEFT(E20,1))<VALUE(RIGHT(E20,1))),1,0)))+IF(G20=\"\",0,IF(OR(LEFT(G20,1)=\"w\",VALUE(LEFT(G20,1))>VALUE(RIGHT(G20,1))),2,IF(OR(VALUE(LEFT(G20,1))<VALUE(RIGHT(G20,1))),1,0))))","v":3},{"$f":"IF(I20=0,\"\",RANK(I20,$I$18:$I$21))","v":4}]
[4,"Flégr Samuel   (KMST Liberec) - U17",null,{"$f":"RIGHT(G18,1)&\":\"&LEFT(G18,1)","v":"0:3"},{"$f":"RIGHT(G19,1)&\":\"&LEFT(G19,1)","v":"1:3"},{"$f":"RIGHT(G20,1)&\":\"&LEFT(G20,1)","v":"3:1"},"xxx",null,{"$f":"IF(B21=\"\",0,IF(D21=\":\",0,IF(OR(LEFT(D21,1)=\"w\",VALUE(LEFT(D21,1))>VALUE(RIGHT(D21,1))),2,IF(OR(VALUE(LEFT(D21,1))<VALUE(RIGHT(D21,1))),1,0)))+IF(E21=\":\",0,IF(OR(LEFT(E21,1)=\"w\",VALUE(LEFT(E21,1))>VALUE(RIGHT(E21,1))),2,IF(OR(VALUE(LEFT(E21,1))<VALUE(RIGHT(E21,1))),1,0)))+IF(F21=\":\",0,IF(OR(LEFT(F21,1)=\"w\",VALUE(LEFT(F21,1))>VALUE(RIGHT(F21,1))),2,IF(OR(VALUE(LEFT(F21,1))<VALUE(RIGHT(F21,1))),1,0))))","v":4},{"$f":"IF(I21=0,\"\",RANK(I21,$I$18:$I$21))","v":3}]
[]
[null,"Skupina H","škola/klub",1,2,3,4,"sety","b","m"]
[1,"Krotilová Adéla   (SKST Liberec) - U15",null,"xxx","1:3","3:0","3:1",null,{"$f":"IF(B24=\"\",0,IF(E24=\"\",0,IF(OR(LEFT(E24,1)=\"w\",VALUE(LEFT(E24,1))>VALUE(RIGHT(E24,1))),2,IF(OR(VALUE(LEFT(E24,1))<VALUE(RIGHT(E24,1))),1,0)))+IF(F24=\"\",0,IF(OR(LEFT(F24,1)=\"w\",VALUE(LEFT(F24,1))>VALUE(RIGHT(F24,1))),2,IF(OR(VALUE(LEFT(F24,1))<VALUE(RIGHT(F24,1))),1,0)))+IF(G24=\"\",0,IF(OR(LEFT(G24,1)=\"w\",VALUE(LEFT(G24,1))>VALUE(RIGHT(G24,1))),2,IF(OR(VALUE(LEFT(G24,1))<VALUE(RIGHT(G24,1))),1,0))))","v":5},2,"4:4","17:17"]
[2,"Königová Anežka    (STAR Turnov) - U15",null,{"$f":"RIGHT(E24,1)&\":\"&LEFT(E24,1)","v":"3:1"},"xxx","3:0","1:3",null,{"$f":"IF(B25=\"\",0,IF(D25=\":\",0,IF(OR(LEFT(D25,1)=\"w\",VALUE(LEFT(D25,1))>VALUE(RIGHT(D25,1))),2,IF(OR(VALUE(LEFT(D25,1))<VALUE(RIGHT(D25,1))),1,0)))+IF(F25=\"\",0,IF(OR(LEFT(F25,1)=\"w\",VALUE(LEFT(F25,1))>VALUE(RIGHT(F25,1))),2,IF(OR(VALUE(LEFT(F25,1))<VALUE(RIGHT(F25,1))),1,0)))+IF(G25=\"\",0,IF(OR(LEFT(G25,1)=\"w\",VALUE(LEFT(G25,1))>VALUE(RIGHT(G25,1))),2,IF(OR(VALUE(LEFT(G25,1))<VALUE(RIGHT(G25,1))),1,0))))","v":5},3]
[3,"Trojan  Jáchym (KMST Liberec) - U13",null,{"$f":"RIGHT(F24,1)&\":\"&LEFT(F24,1)","v":"0:3"},{"$f":"RIGHT(F25,1)&\":\"&LEFT(F25,1)","v":"0:3"},"xxx","0:3",null,{"$f":"IF(B26=\"\",0,IF(D26=\":\",0,IF(OR(LEFT(D26,1)=\"w\",VALUE(LEFT(D26,1))>VALUE(RIGHT(D26,1))),2,IF(OR(VALUE(LEFT(D26,1))<VALUE(RIGHT(D26,1))),1,0)))+IF(E26=\":\",0,IF(OR(LEFT(E26,1)=\"w\",VALUE(LEFT(E26,1))>VALUE(RIGHT(E26,1))),2,IF(OR(VALUE(LEFT(E26,1))<VALUE(RIGHT(E26,1))),1,0)))+IF(G26=\"\",0,IF(OR(LEFT(G26,1)=\"w\",VALUE(LEFT(G26,1))>VALUE(RIGHT(G26,1))),2,IF(OR(VALUE(LEFT(G26,1))<VALUE(RIGHT(G26,1))),1,0))))","v":3},4,"4:4","14:15"]
[4,"Kožich Vítek (SKST Liberec) - U13",null,{"$f":"RIGHT(G24,1)&\":\"&LEFT(G24,1)","v":"1:3"},{"$f":"RIGHT(G25,1)&\":\"&LEFT(G25,1)","v":"3:1"},{"$f":"RIGHT(G26,1)&\":\"&LEFT(G26,1)","v":"3:0"},"xxx",null,{"$f":"IF(B27=\"\",0,IF(D27=\":\",0,IF(OR(LEFT(D27,1)=\"w\",VALUE(LEFT(D27,1))>VALUE(RIGHT(D27,1))),2,IF(OR(VALUE(LEFT(D27,1))<VALUE(RIGHT(D27,1))),1,0)))+IF(E27=\":\",0,IF(OR(LEFT(E27,1)=\"w\",VALUE(LEFT(E27,1))>VALUE(RIGHT(E27,1))),2,IF(OR(VALUE(LEFT(E27,1))<VALUE(RIGHT(E27,1))),1,0)))+IF(F27=\":\",0,IF(OR(LEFT(F27,1)=\"w\",VALUE(LEFT(F27,1))>VALUE(RIGHT(F27,1))),2,IF(OR(VALUE(LEFT(F27,1))<VALUE(RIGHT(F27,1))),1,0))))","v":5},1,"4:4","16:15"]

{"sheet":"B_finale","index":5,"n_rows":40,"n_cols":4,"rows_kept":40,"cut":false,"hidden":false,"merged":[[0,1,0,2],[1,1,1,2],[2,1,2,2],[3,1,3,2]]}
["Název soutěže:",{"$f":"A_skupiny!A1","v":"10. KBT Libereckého kraje"}]
[]
["Kategorie, den",{"$f":"A_skupiny!A3","v":"Turnov, 14.05.2022"}]
["Kolo","Divize B finále"]
[]
[{"$f":"'2divize-A'!A5","v":"o 1.-8.. místo"}]
["Šedo Pavel   (KMST Liberec) - U17"]
[null,"Šedo Pavel   (KMST Liberec) - U17"]
["Korpová Tereza (AST Kam. Šenov) - U11",{"$f":"IF('2divize-A'!D6=\"\",\"\",IF(LEFT('2divize-A'!D6,1)>RIGHT('2divize-A'!D6,1),'2divize-A'!D6,RIGHT('2divize-A'!D6,1)&\":\"&LEFT('2divize-A'!D6,1)))","v":"3:0"}]
[null,null,"Šedo Pavel   (KMST Liberec) - U17"]
["Krotilová Asdéla (SKST Liberec) - U15",null,"3:1"]
[null,"Bartoň David (SKST Liberec) - 15"]
["Bartoň David (SKST Liberec) - 15",{"$f":"IF('2divize-A'!D7=\"\",\"\",IF(LEFT('2divize-A'!D7,1)>RIGHT('2divize-A'!D7,1),'2divize-A'!D7,RIGHT('2divize-A'!D7,1)&\":\"&LEFT('2divize-A'!D7,1)))","v":"3:0"}]
[null,null,null,"Šedo Pavel   (KMST Liberec) - U17"]
["Kožich Vítek (SKST Liberec) - U13",null,null,"3:1"]
[null,"Košťák Matěj (Bižu Jablonec) - U15"]
["Košťák Matěj (Bižu Jablonec) - U15","3:1"]
[null,null,{"$f":"'2divize-A'!C23","v":"Csizmazia Antonín   (STAR Turnov) - U11"}]
["Závětová Lucie (ST Frýdlant) - U19",null,{"$f":"IF('2divize-A'!D19=\"\",\"\",IF(LEFT('2divize-A'!D19,1)>RIGHT('2divize-A'!D19,1),'2divize-A'!D19,RIGHT('2divize-A'!D19,1)&\":\"&LEFT('2divize-A'!D19,1)))","v":"3:1"}]
[null,"Nypl Patrik (Bižu Jablonec) - U13"]
["Nypl Patrik (Bižu Jablonec) - U13","3:2"]
[]
[{"$f":"'2divize-A'!A10","v":"o 5.-8. místo"}]
["Korpová Tereza (AST Kam. Šenov) - U11",null,{"$f":"IF('2divize-A'!D57=\"\",\"\",IF(LEFT('2divize-A'!D57,1)>RIGHT('2divize-A'!D57,1),'2divize-A'!D57,RIGHT('2divize-A'!D57,1)&\":\"&LEFT('2divize-A'!D57,1)))","v":""}]
[null,"Krotilová Asdéla (SKST Liberec) - U15"]
["Krotilová Asdéla (SKST Liberec) - U15",{"$f":"IF('2divize-A'!D11=\"\",\"\",IF(LEFT('2divize-A'!D11,1)>RIGHT('2divize-A'!D11,1),'2divize-A'!D11,RIGHT('2divize-A'!D11,1)&\":\"&LEFT('2divize-A'!D11,1)))","v":"3:1"}]
[null,null,"Krotilová Asdéla (SKST Liberec) - U15"]
["Kožich Vítek (SKST Liberec) - U13",null,"3:1"]
[null,"Kožich Vítek (SKST Liberec) - U13"]
["Závětová Lucie (ST Frýdlant) - U19",{"$f":"IF('2divize-A'!D12=\"\",\"\",IF(LEFT('2divize-A'!D12,1)>RIGHT('2divize-A'!D12,1),'2divize-A'!D12,RIGHT('2divize-A'!D12,1)&\":\"&LEFT('2divize-A'!D12,1)))","v":"3:0"}]
[]
[{"$f":"'2divize-A'!A13","v":"o 3.-4. místo"}]
["Bartoň David (SKST Liberec) - 15"]
[null,"Košťák Matěj (Bižu Jablonec) - U15"]
["Košťák Matěj (Bižu Jablonec) - U15","3:1"]
[]
[{"$f":"'2divize-A'!A15","v":"o 7.-8. místo"}]
["Korpová Tereza (AST Kam. Šenov) - U11"]
[null,"Závětová Lucie (ST Frýdlant) - U19"]
["Závětová Lucie (ST Frýdlant) - U19","3:2"]

{"sheet":"B_utecha","index":6,"n_rows":40,"n_cols":4,"rows_kept":40,"cut":false,"hidden":false,"merged":[[0,1,0,2],[1,1,1,2],[2,1,2,2],[3,1,3,2]]}
["Název soutěže:",{"$f":"A_skupiny!A1","v":"10. KBT Libereckého kraje"}]
[]
["Kategorie, den",{"$f":"A_skupiny!A3","v":"Turnov, 14.05.2022"}]
["Kolo","Divize B útěcha"]
[]
[{"$f":"'2divize-B'!A5","v":"o 9.-16. místo"}]
["Adamíra Šimon (Orel Lomnice) - U15"]
[null,"Adamíra Šimon (Orel Lomnice) - U15"]
["Trojan Jáchym (KMST Liberec) - U13",{"$f":"IF('2divize-B'!D6=\"\",\"\",IF(LEFT('2divize-B'!D6,1)>RIGHT('2divize-B'!D6,1),'2divize-B'!D6,RIGHT('2divize-B'!D6,1)&\":\"&LEFT('2divize-B'!D6,1)))","v":"3:0"}]
[null,null,"Adamíra Šimon (Orel Lomnice) - U15"]
["Voplakal Vojtěch (SKST Liberec) - U11",null,"3:0"]
[null,"Voplakal Vojtěch (SKST Liberec) - U11"]
["Kubíček Tomáš (STAR Turnov) - U15",{"$f":"IF('2divize-B'!D7=\"\",\"\",IF(LEFT('2divize-B'!D7,1)>RIGHT('2divize-B'!D7,1),'2divize-B'!D7,RIGHT('2divize-B'!D7,1)&\":\"&LEFT('2divize-B'!D7,1)))","v":"3:0"}]
[null,null,null,"Kuntoš Filip (KMST Liberec) - U17"]
["Flégr Samuel (KMST Liberec) - U17",null,null,{"$f":"IF('2divize-B'!D23=\"\",\"\",IF(LEFT('2divize-B'!D23,1)>RIGHT('2divize-B'!D23,1),'2divize-B'!D23,RIGHT('2divize-B'!D23,1)&\":\"&LEFT('2divize-B'!D23,1)))","v":"3:1"}]
[null,"Königová Anežka (STAR Turnov) - U15"]
["Königová Anežka (STAR Turnov) - U15",{"$f":"IF('2divize-B'!D8=\"\",\"\",IF(LEFT('2divize-B'!D8,1)>RIGHT('2divize-B'!D8,1),'2divize-B'!D8,RIGHT('2divize-B'!D8,1)&\":\"&LEFT('2divize-B'!D8,1)))","v":"3:1"}]
[null,null,"Kuntoš Filip (KMST Liberec) - U17"]
["Günter Tomáš (KMST Liberec) - U13",null,"3:2"]
[null,"Kuntoš Filip (KMST Liberec) - U17"]
["Kuntoš Filip (KMST Liberec) - U17","3:0"]
[]
[{"$f":"'2divize-B'!A10","v":"o 13.-16. místo"}]
["Trojan Jáchym (KMST Liberec) - U13",null,{"$f":"IF('2divize-B'!D57=\"\",\"\",IF(LEFT('2divize-B'!D57,1)>RIGHT('2divize-B'!D57,1),'2divize-B'!D57,RIGHT('2divize-B'!D57,1)&\":\"&LEFT('2divize-B'!D57,1)))","v":""}]
[null,"Kubíček Tomáš (STAR Turnov) - U15"]
["Kubíček Tomáš (STAR Turnov) - U15","3:0"]
[null,null,"Günter Tomáš (KMST Liberec) - U13"]
["Flégr Samuel (KMST Liberec) - U17",null,{"$f":"IF('2divize-B'!D21=\"\",\"\",IF(LEFT('2divize-B'!D21,1)>RIGHT('2divize-B'!D21,1),'2divize-B'!D21,RIGHT('2divize-B'!D21,1)&\":\"&LEFT('2divize-B'!D21,1)))","v":"3:0"}]
[null,"Günter Tomáš (KMST Liberec) - U13"]
["Günter Tomáš (KMST Liberec) - U13",{"$f":"IF('2divize-B'!D12=\"\",\"\",IF(LEFT('2divize-B'!D12,1)>RIGHT('2divize-B'!D12,1),'2divize-B'!D12,RIGHT('2divize-B'!D12,1)&\":\"&LEFT('2divize-B'!D12,1)))","v":"3:2"}]
[]
[{"$f":"'2divize-B'!A13","v":"o 11.-12. místo"}]
["Voplakal Vojtěch (SKST Liberec) - U11"]
[null,"Königová Anežka (STAR Turnov) - U15"]
["Königová Anežka (STAR Turnov) - U15","3:2"]
[]
[{"$f":"'2divize-B'!A15","v":"o 15.-16. místo"}]
["Trojan Jáchym (KMST Liberec) - U13"]
[null,"Flégr Samuel (KMST Liberec) - U17"]
["Flégr Samuel (KMST Liberec) - U17",{"$f":"IF('2divize-B'!D16=\"\",\"\",IF(LEFT('2divize-B'!D16,1)>RIGHT('2divize-B'!D16,1),'2divize-B'!D16,RIGHT('2divize-B'!D16,1)&\":\"&LEFT('2divize-B'!D16,1)))","v":"3:0"}]

{"sheet":"C_skupiny","index":7,"n_rows":27,"n_cols":10,"rows_kept":27,"cut":false,"hidden":false,"merged":[[26,1,26,2],[18,1,18,2],[19,1,19,2],[20,1,20,2],[23,1,23,2],[24,1,24,2],[25,1,25,2],[17,1,17,2],[0,0,0,9],[2,0,2,3],[3,0,3,2],[5,1,5,2],[6,1,6,2],[7,1,7,2],[8,1,8,2],[11,1,11,2],[12,1,12,2],[13,1,13,2],[14,1,14,2]]}
[{"$f":"A_skupiny!A1","v":"10. KBT Libereckého kraje"}]
[]
[{"$f":"A_skupiny!A3","v":"Turnov, 14.05.2022"}]
["Divize C skupiny"]
[null,"skupina I","škola/klub",1,2,3,4,"sety","b","m"]
[1,"Panáček Filip (Loko Česká Lípa) - U13",null,"xxx","3:0","3:0","3:0",null,{"$f":"IF(B6=\"\",0,IF(E6=\"\",0,IF(OR(LEFT(E6,1)=\"w\",VALUE(LEFT(E6,1))>VALUE(RIGHT(E6,1))),2,IF(OR(VALUE(LEFT(E6,1))<VALUE(RIGHT(E6,1))),1,0)))+IF(F6=\"\",0,IF(OR(LEFT(F6,1)=\"w\",VALUE(LEFT(F6,1))>VALUE(RIGHT(F6,1))),2,IF(OR(VALUE(LEFT(F6,1))<VALUE(RIGHT(F6,1))),1,0)))+IF(G6=\"\",0,IF(OR(LEFT(G6,1)=\"w\",VALUE(LEFT(G6,1))>VALUE(RIGHT(G6,1))),2,IF(OR(VALUE(LEFT(G6,1))<VALUE(RIGHT(G6,1))),1,0))))","v":6},{"$f":"IF(I6=0,\"\",RANK(I6,$I$6:$I$9))","v":1}]
[2,"Bárta Tomáš (STAR Turnov) - U17",null,{"$f":"RIGHT(E6,1)&\":\"&LEFT(E6,1)","v":"0:3"},"xxx","3:0","3:0",null,{"$f":"IF(B7=\"\",0,IF(D7=\":\",0,IF(OR(LEFT(D7,1)=\"w\",VALUE(LEFT(D7,1))>VALUE(RIGHT(D7,1))),2,IF(OR(VALUE(LEFT(D7,1))<VALUE(RIGHT(D7,1))),1,0)))+IF(F7=\"\",0,IF(OR(LEFT(F7,1)=\"w\",VALUE(LEFT(F7,1))>VALUE(RIGHT(F7,1))),2,IF(OR(VALUE(LEFT(F7,1))<VALUE(RIGHT(F7,1))),1,0)))+IF(G7=\"\",0,IF(OR(LEFT(G7,1)=\"w\",VALUE(LEFT(G7,1))>VALUE(RIGHT(G7,1))),2,IF(OR(VALUE(LEFT(G7,1))<VALUE(RIGHT(G7,1))),1,0))))","v":5},{"$f":"IF(I7=0,\"\",RANK(I7,$I$6:$I$9))","v":2}]
[3,"Cyprián Ondřej (SKST Liberec) - U13",null,{"$f":"RIGHT(F6,1)&\":\"&LEFT(F6,1)","v":"0:3"},{"$f":"RIGHT(F7,1)&\":\"&LEFT(F7,1)","v":"0:3"},"xxx","3:0",null,{"$f":"IF(B8=\"\",0,IF(D8=\":\",0,IF(OR(LEFT(D8,1)=\"w\",VALUE(LEFT(D8,1))>VALUE(RIGHT(D8,1))),2,IF(OR(VALUE(LEFT(D8,1))<VALUE(RIGHT(D8,1))),1,0)))+IF(E8=\":\",0,IF(OR(LEFT(E8,1)=\"w\",VALUE(LEFT(E8,1))>VALUE(RIGHT(E8,1))),2,IF(OR(VALUE(LEFT(E8,1))<VALUE(RIGHT(E8,1))),1,0)))+IF(G8=\"\",0,IF(OR(LEFT(G8,1)=\"w\",VALUE(LEFT(G8,1))>VALUE(RIGHT(G8,1))),2,IF(OR(VALUE(LEFT(G8,1))<VALUE(RIGHT(G8,1))),1,0))))","v":4},{"$f":"IF(I8=0,\"\",RANK(I8,$I$6:$I$9))","v":3}]
[4,"Motl Matyáš (KMST Liberec) - U13",null,{"$f":"RIGHT(G6,1)&\":\"&LEFT(G6,1)","v":"0:3"},{"$f":"RIGHT(G7,1)&\":\"&LEFT(G7,1)","v":"0:3"},{"$f":"RIGHT(G8,1)&\":\"&LEFT(G8,1)","v":"0:3"},"xxx",null,{"$f":"IF(B9=\"\",0,IF(D9=\":\",0,IF(OR(LEFT(D9,1)=\"w\",VALUE(LEFT(D9,1))>VALUE(RIGHT(D9,1))),2,IF(OR(VALUE(LEFT(D9,1))<VALUE(RIGHT(D9,1))),1,0)))+IF(E9=\":\",0,IF(OR(LEFT(E9,1)=\"w\",VALUE(LEFT(E9,1))>VALUE(RIGHT(E9,1))),2,IF(OR(VALUE(LEFT(E9,1))<VALUE(RIGHT(E9,1))),1,0)))+IF(F9=\":\",0,IF(OR(LEFT(F9,1)=\"w\",VALUE(LEFT(F9,1))>VALUE(RIGHT(F9,1))),2,IF(OR(VALUE(LEFT(F9,1))<VALUE(RIGHT(F9,1))),1,0))))","v":3},{"$f":"IF(I9=0,\"\",RANK(I9,$I$6:$I$9))","v":4}]
[]
[null,"skupina J","škola/klub",1,2,3,4,"sety","b","m"]
[1,"Stach Vojtěch   (STAR Turnov) - U17",null,"xxx","3:1","3:0","3:0",null,{"$f":"IF(B12=\"\",0,IF(E12=\"\",0,IF(OR(LEFT(E12,1)=\"w\",VALUE(LEFT(E12,1))>VALUE(RIGHT(E12,1))),2,IF(OR(VALUE(LEFT(E12,1))<VALUE(RIGHT(E12,1))),1,0)))+IF(F12=\"\",0,IF(OR(LEFT(F12,1)=\"w\",VALUE(LEFT(F12,1))>VALUE(RIGHT(F12,1))),2,IF(OR(VALUE(LEFT(F12,1))<VALUE(RIGHT(F12,1))),1,0)))+IF(G12=\"\",0,IF(OR(LEFT(G12,1)=\"w\",VALUE(LEFT(G12,1))>VALUE(RIGHT(G12,1))),2,IF(OR(VALUE(LEFT(G12,1))<VALUE(RIGHT(G12,1))),1,0))))","v":6},{"$f":"IF(I12=0,\"\",RANK(I12,$I$12:$I$15))","v":1}]
[2,"Vaněk Tomáš (SKST Liberec) - U19",null,{"$f":"RIGHT(E12,1)&\":\"&LEFT(E12,1)","v":"1:3"},"xxx","3:0","3:1",null,{"$f":"IF(B13=\"\",0,IF(D13=\":\",0,IF(OR(LEFT(D13,1)=\"w\",VALUE(LEFT(D13,1))>VALUE(RIGHT(D13,1))),2,IF(OR(VALUE(LEFT(D13,1))<VALUE(RIGHT(D13,1))),1,0)))+IF(F13=\"\",0,IF(OR(LEFT(F13,1)=\"w\",VALUE(LEFT(F13,1))>VALUE(RIGHT(F13,1))),2,IF(OR(VALUE(LEFT(F13,1))<VALUE(RIGHT(F13,1))),1,0)))+IF(G13=\"\",0,IF(OR(LEFT(G13,1)=\"w\",VALUE(LEFT(G13,1))>VALUE(RIGHT(G13,1))),2,IF(OR(VALUE(LEFT(G13,1))<VALUE(RIGHT(G13,1))),1,0))))","v":5},{"$f":"IF(I13=0,\"\",RANK(I13,$I$12:$I$15))","v":2}]
[3,"Porš Zdeněk (SKLST Liberec) - U17",null,{"$f":"RIGHT(F12,1)&\":\"&LEFT(F12,1)","v":"0:3"},{"$f":"RIGHT(F13,1)&\":\"&LEFT(F13,1)","v":"0:3"},"xxx","3:1",null,{"$f":"IF(B14=\"\",0,IF(D14=\":\",0,IF(OR(LEFT(D14,1)=\"w\",VALUE(LEFT(D14,1))>VALUE(RIGHT(D14,1))),2,IF(OR(VALUE(LEFT(D14,1))<VALUE(RIGHT(D14,1))),1,0)))+IF(E14=\":\",0,IF(OR(LEFT(E14,1)=\"w\",VALUE(LEFT(E14,1))>VALUE(RIGHT(E14,1))),2,IF(OR(VALUE(LEFT(E14,1))<VALUE(RIGHT(E14,1))),1,0)))+IF(G14=\"\",0,IF(OR(LEFT(G14,1)=\"w\",VALUE(LEFT(G14,1))>VALUE(RIGHT(G14,1))),2,IF(OR(VALUE(LEFT(G14,1))<VALUE(RIGHT(G14,1))),1,0))))","v":4},{"$f":"IF(I14=0,\"\",RANK(I14,$I$12:$I$15))","v":3}]
[4,"Klingr Petr (Spartak Chrastava) - U13",null,{"$f":"RIGHT(G12,1)&\":\"&LEFT(G12,1)","v":"0:3"},{"$f":"RIGHT(G13,1)&\":\"&LEFT(G13,1)","v":"1:3"},{"$f":"RIGHT(G14,1)&\":\"&LEFT(G14,1)","v":"1:3"},"xxx",null,{"$f":"IF(B15=\"\",0,IF(D15=\":\",0,IF(OR(LEFT(D15,1)=\"w\",VALUE(LEFT(D15,1))>VALUE(RIGHT(D15,1))),2,IF(OR(VALUE(LEFT(D15,1))<VALUE(RIGHT(D15,1))),1,0)))+IF(E15=\":\",0,IF(OR(LEFT(E15,1)=\"w\",VALUE(LEFT(E15,1))>VALUE(RIGHT(E15,1))),2,IF(OR(VALUE(LEFT(E15,1))<VALUE(RIGHT(E15,1))),1,0)))+IF(F15=\":\",0,IF(OR(LEFT(F15,1)=\"w\",VALUE(LEFT(F15,1))>VALUE(RIGHT(F15,1))),2,IF(OR(VALUE(LEFT(F15,1))<VALUE(RIGHT(F15,1))),1,0))))","v":3},{"$f":"IF(I15=0,\"\",RANK(I15,$I$12:$I$15))","v":4}]
[]
[null,"Skupina K","škola/klub",1,2,3,4,"sety","b","m"]
[1,"Stejskal Šimon (SKST Liberec) - U13",null,"xxx","2:3","3:1","3:1",null,{"$f":"IF(B18=\"\",0,IF(E18=\"\",0,IF(OR(LEFT(E18,1)=\"w\",VALUE(LEFT(E18,1))>VALUE(RIGHT(E18,1))),2,IF(OR(VALUE(LEFT(E18,1))<VALUE(RIGHT(E18,1))),1,0)))+IF(F18=\"\",0,IF(OR(LEFT(F18,1)=\"w\",VALUE(LEFT(F18,1))>VALUE(RIGHT(F18,1))),2,IF(OR(VALUE(LEFT(F18,1))<VALUE(RIGHT(F18,1))),1,0)))+IF(G18=\"\",0,IF(OR(LEFT(G18,1)=\"w\",VALUE(LEFT(G18,1))>VALUE(RIGHT(G18,1))),2,IF(OR(VALUE(LEFT(G18,1))<VALUE(RIGHT(G18,1))),1,0))))","v":5},{"$f":"IF(I18=0,\"\",RANK(I18,$I$18:$I$21))","v":2}]
[2,"Krejčík Jan (Bižu Jablonec) - U132",null,{"$f":"RIGHT(E18,1)&\":\"&LEFT(E18,1)","v":"3:2"},"xxx","3:0","3:0",null,{"$f":"IF(B19=\"\",0,IF(D19=\":\",0,IF(OR(LEFT(D19,1)=\"w\",VALUE(LEFT(D19,1))>VALUE(RIGHT(D19,1))),2,IF(OR(VALUE(LEFT(D19,1))<VALUE(RIGHT(D19,1))),1,0)))+IF(F19=\"\",0,IF(OR(LEFT(F19,1)=\"w\",VALUE(LEFT(F19,1))>VALUE(RIGHT(F19,1))),2,IF(OR(VALUE(LEFT(F19,1))<VALUE(RIGHT(F19,1))),1,0)))+IF(G19=\"\",0,IF(OR(LEFT(G19,1)=\"w\",VALUE(LEFT(G19,1))>VALUE(RIGHT(G19,1))),2,IF(OR(VALUE(LEFT(G19,1))<VALUE(RIGHT(G19,1))),1,0))))","v":6},{"$f":"IF(I19=0,\"\",RANK(I19,$I$18:$I$21))","v":1}]
[3,"Nohejl Vojtěch (ST Frýdlant) - U13",null,{"$f":"RIGHT(F18,1)&\":\"&LEFT(F18,1)","v":"1:3"},{"$f":"RIGHT(F19,1)&\":\"&LEFT(F19,1)","v":"0:3"},"xxx","1:3",null,{"$f":"IF(B20=\"\",0,IF(D20=\":\",0,IF(OR(LEFT(D20,1)=\"w\",VALUE(LEFT(D20,1))>VALUE(RIGHT(D20,1))),2,IF(OR(VALUE(LEFT(D20,1))<VALUE(RIGHT(D20,1))),1,0)))+IF(E20=\":\",0,IF(OR(LEFT(E20,1)=\"w\",VALUE(LEFT(E20,1))>VALUE(RIGHT(E20,1))),2,IF(OR(VALUE(LEFT(E20,1))<VALUE(RIGHT(E20,1))),1,0)))+IF(G20=\"\",0,IF(OR(LEFT(G20,1)=\"w\",VALUE(LEFT(G20,1))>VALUE(RIGHT(G20,1))),2,IF(OR(VALUE(LEFT(G20,1))<VALUE(RIGHT(G20,1))),1,0))))","v":3},{"$f":"IF(I20=0,\"\",RANK(I20,$I$18:$I$21))","v":4}]
[4,"Valášek Šimon (KMST Liberec) - U11",null,{"$f":"RIGHT(G18,1)&\":\"&LEFT(G18,1)","v":"1:3"},{"$f":"RIGHT(G19,1)&\":\"&LEFT(G19,1)","v":"0:3"},{"$f":"RIGHT(G20,1)&\":\"&LEFT(G20,1)","v":"3:1"},"xxx",null,{"$f":"IF(B21=\"\",0,IF(D21=\":\",0,IF(OR(LEFT(D21,1)=\"w\",VALUE(LEFT(D21,1))>VALUE(RIGHT(D21,1))),2,IF(OR(VALUE(LEFT(D21,1))<VALUE(RIGHT(D21,1))),1,0)))+IF(E21=\":\",0,IF(OR(LEFT(E21,1)=\"w\",VALUE(LEFT(E21,1))>VALUE(RIGHT(E21,1))),2,IF(OR(VALUE(LEFT(E21,1))<VALUE(RIGHT(E21,1))),1,0)))+IF(F21=\":\",0,IF(OR(LEFT(F21,1)=\"w\",VALUE(LEFT(F21,1))>VALUE(RIGHT(F21,1))),2,IF(OR(VALUE(LEFT(F21,1))<VALUE(RIGHT(F21,1))),1,0))))","v":4},{"$f":"IF(I21=0,\"\",RANK(I21,$I$18:$I$21))","v":3}]
[]
[null,"Skupina L","škola/klub",1,2,3,4,"sety","b","m"]
[1,"Hanoušek Adam (STAR Turnov) - U13",null,"xxx","1:3","0:3","1:3",null,{"$f":"IF(B24=\"\",0,IF(E24=\"\",0,IF(OR(LEFT(E24,1)=\"w\",VALUE(LEFT(E24,1))>VALUE(RIGHT(E24,1))),2,IF(OR(VALUE(LEFT(E24,1))<VALUE(RIGHT(E24,1))),1,0)))+IF(F24=\"\",0,IF(OR(LEFT(F24,1)=\"w\",VALUE(LEFT(F24,1))>VALUE(RIGHT(F24,1))),2,IF(OR(VALUE(LEFT(F24,1))<VALUE(RIGHT(F24,1))),1,0)))+IF(G24=\"\",0,IF(OR(LEFT(G24,1)=\"w\",VALUE(LEFT(G24,1))>VALUE(RIGHT(G24,1))),2,IF(OR(VALUE(LEFT(G24,1))<VALUE(RIGHT(G24,1))),1,0))))","v":3},{"$f":"IF(I24=0,\"\",RANK(I24,$I$24:$I$27))","v":4}]
[2,"Klingr Pavel (Spartak Chrastava) - U15",null,{"$f":"RIGHT(E24,1)&\":\"&LEFT(E24,1)","v":"3:1"},"xxx","0:3","0:3",null,{"$f":"IF(B25=\"\",0,IF(D25=\":\",0,IF(OR(LEFT(D25,1)=\"w\",VALUE(LEFT(D25,1))>VALUE(RIGHT(D25,1))),2,IF(OR(VALUE(LEFT(D25,1))<VALUE(RIGHT(D25,1))),1,0)))+IF(F25=\"\",0,IF(OR(LEFT(F25,1)=\"w\",VALUE(LEFT(F25,1))>VALUE(RIGHT(F25,1))),2,IF(OR(VALUE(LEFT(F25,1))<VALUE(RIGHT(F25,1))),1,0)))+IF(G25=\"\",0,IF(OR(LEFT(G25,1)=\"w\",VALUE(LEFT(G25,1))>VALUE(RIGHT(G25,1))),2,IF(OR(VALUE(LEFT(G25,1))<VALUE(RIGHT(G25,1))),1,0))))","v":4},{"$f":"IF(I25=0,\"\",RANK(I25,$I$24:$I$27))","v":3}]
[3,"Rak Oliver (KMST Lieberec) - U11",null,{"$f":"RIGHT(F24,1)&\":\"&LEFT(F24,1)","v":"3:0"},{"$f":"RIGHT(F25,1)&\":\"&LEFT(F25,1)","v":"3:0"},"xxx","3:0",null,{"$f":"IF(B26=\"\",0,IF(D26=\":\",0,IF(OR(LEFT(D26,1)=\"w\",VALUE(LEFT(D26,1))>VALUE(RIGHT(D26,1))),2,IF(OR(VALUE(LEFT(D26,1))<VALUE(RIGHT(D26,1))),1,0)))+IF(E26=\":\",0,IF(OR(LEFT(E26,1)=\"w\",VALUE(LEFT(E26,1))>VALUE(RIGHT(E26,1))),2,IF(OR(VALUE(LEFT(E26,1))<VALUE(RIGHT(E26,1))),1,0)))+IF(G26=\"\",0,IF(OR(LEFT(G26,1)=\"w\",VALUE(LEFT(G26,1))>VALUE(RIGHT(G26,1))),2,IF(OR(VALUE(LEFT(G26,1))<VALUE(RIGHT(G26,1))),1,0))))","v":6},{"$f":"IF(I26=0,\"\",RANK(I26,$I$24:$I$27))","v":1}]
[4,"Šulc Štěpán (SKST Liberec) - U13",null,{"$f":"RIGHT(G24,1)&\":\"&LEFT(G24,1)","v":"3:1"},{"$f":"RIGHT(G25,1)&\":\"&LEFT(G25,1)","v":"3:0"},{"$f":"RIGHT(G26,1)&\":\"&LEFT(G26,1)","v":"0:3"},"xxx",null,{"$f":"IF(B27=\"\",0,IF(D27=\":\",0,IF(OR(LEFT(D27,1)=\"w\",VALUE(LEFT(D27,1))>VALUE(RIGHT(D27,1))),2,IF(OR(VALUE(LEFT(D27,1))<VALUE(RIGHT(D27,1))),1,0)))+IF(E27=\":\",0,IF(OR(LEFT(E27,1)=\"w\",VALUE(LEFT(E27,1))>VALUE(RIGHT(E27,1))),2,IF(OR(VALUE(LEFT(E27,1))<VALUE(RIGHT(E27,1))),1,0)))+IF(F27=\":\",0,IF(OR(LEFT(F27,1)=\"w\",VALUE(LEFT(F27,1))>VALUE(RIGHT(F27,1))),2,IF(OR(VALUE(LEFT(F27,1))<VALUE(RIGHT(F27,1))),1,0))))","v":5},{"$f":"IF(I27=0,\"\",RANK(I27,$I$24:$I$27))","v":2}]

{"sheet":"div_4","index":8,"n_rows":31,"n_cols":10,"rows_kept":31,"cut":false,"hidden":true,"merged":[[8,1,8,2],[0,0,0,9],[5,1,5,2],[6,1,6,2],[2,0,2,3],[7,1,7,2],[3,0,3,2],[30,1,30,2],[29,1,29,2],[9,1,9,2],[12,1,12,2],[13,1,13,2],[15,1,15,2],[16,1,16,2],[19,1,19,2],[20,1,20,2],[22,1,22,2],[23,1,23,2],[26,1,26,2],[27,1,27,2],[14,1,14,2],[21,1,21,2],[28,1,28,2]]}
[{"$f":"A_skupiny!A1","v":"10. KBT Libereckého kraje"}]
[]
[{"$f":"A_skupiny!A3","v":"Turnov, 14.05.2022"}]
["Divize 4- základní skupiny"]
[null,"skupina I","škola/klub",1,2,3,4,5,"b","m"]
[1,null,null,"xxx",null,null,null,null,null,{"$f":"IF(I6=0,\"\",RANK(I6,$I$6:$I$10))","v":""}]
[2,null,null,{"$f":"RIGHT(E6,1)&\":\"&LEFT(E6,1)","v":":"},"xxx",null,null,null,null,{"$f":"IF(I7=0,\"\",RANK(I7,$I$6:$I$10))","v":""}]
[3,null,null,{"$f":"RIGHT(F6,1)&\":\"&LEFT(F6,1)","v":":"},{"$f":"RIGHT(F7,1)&\":\"&LEFT(F7,1)","v":":"},"xxx",null,null,null,""]
[4,null,null,{"$f":"RIGHT(G6,1)&\":\"&LEFT(G6,1)","v":":"},{"$f":"RIGHT(G7,1)&\":\"&LEFT(G7,1)","v":":"},{"$f":"RIGHT(G8,1)&\":\"&LEFT(G8,1)","v":":"},"xxx",null,null,""]
[5,null,null,{"$f":"RIGHT(H6,1)&\":\"&LEFT(H6,1)","v":":"},{"$f":"RIGHT(H7,1)&\":\"&LEFT(H7,1)","v":":"},{"$f":"RIGHT(H8,1)&\":\"&LEFT(H8,1)","v":":"},{"$f":"RIGHT(H9,1)&\":\"&LEFT(H9,1)","v":":"},"xxx",null,""]
[]
[null,"skupina J","škola/klub",1,2,3,4,5,"b","m"]
[1,null,null,"xxx",null,null,null,null,null,{"$f":"IF(I13=0,\"\",RANK(I13,$I$13:$I$17))","v":""}]
[2,null,null,{"$f":"RIGHT(E13,1)&\":\"&LEFT(E13,1)","v":":"},"xxx",null,null,null,null,{"$f":"IF(I14=0,\"\",RANK(I14,$I$13:$I$17))","v":""}]
[3,null,null,{"$f":"RIGHT(F13,1)&\":\"&LEFT(F13,1)","v":":"},{"$f":"RIGHT(F14,1)&\":\"&LEFT(F14,1)","v":":"},"xxx",null,null,null,""]
[4,null,null,{"$f":"RIGHT(G13,1)&\":\"&LEFT(G13,1)","v":":"},{"$f":"RIGHT(G14,1)&\":\"&LEFT(G14,1)","v":":"},{"$f":"RIGHT(G15,1)&\":\"&LEFT(G15,1)","v":":"},"xxx",null,null,""]
[5,null,null,{"$f":"RIGHT(H13,1)&\":\"&LEFT(H13,1)","v":":"},{"$f":"RIGHT(H14,1)&\":\"&LEFT(H14,1)","v":":"},{"$f":"RIGHT(H15,1)&\":\"&LEFT(H15,1)","v":":"},{"$f":"RIGHT(H16,1)&\":\"&LEFT(H16,1)","v":":"},"xxx",null,""]
[]
[null,"skupina K","škola/klub",1,2,3,4,5,"b","m"]
[1,"Benešová Nikola  (Spartak Chrastava) - U15",null,"xxx",null,null,null,null,null,{"$f":"IF(I20=0,\"\",RANK(I20,$I$20:$I$24))","v":""}]
[2,null,null,{"$f":"RIGHT(E20,1)&\":\"&LEFT(E20,1)","v":":"},"xxx",null,null,null,null,{"$f":"IF(I21=0,\"\",RANK(I21,$I$20:$I$24))","v":""}]
[3,null,null,{"$f":"RIGHT(F20,1)&\":\"&LEFT(F20,1)","v":":"},{"$f":"RIGHT(F21,1)&\":\"&LEFT(F21,1)","v":":"},"xxx"]
[4,null,null,{"$f":"RIGHT(G20,1)&\":\"&LEFT(G20,1)","v":":"},{"$f":"RIGHT(G21,1)&\":\"&LEFT(G21,1)","v":":"},{"$f":"RIGHT(G22,1)&\":\"&LEFT(G22,1)","v":":"},"xxx",null,null,{"$f":"IF(I23=0,\"\",RANK(I23,$I$20:$I$24))","v":""}]
[5,null,null,{"$f":"RIGHT(H20,1)&\":\"&LEFT(H20,1)","v":":"},{"$f":"RIGHT(H21,1)&\":\"&LEFT(H21,1)","v":":"},{"$f":"RIGHT(H22,1)&\":\"&LEFT(H22,1)","v":":"},{"$f":"RIGHT(H23,1)&\":\"&LEFT(H23,1)","v":":"},"xxx",null,{"$f":"IF(I24=0,\"\",RANK(I24,$I$20:$I$24))","v":""}]
[]
[null,"skupina L","škola/klub",1,2,3,4,5,"b","m"]
[1,null,null,"xxx",null,null,null,null,null,{"$f":"IF(I27=0,\"\",RANK(I27,$I$27:$I$31))","v":""}]
[2,null,null,{"$f":"RIGHT(E27,1)&\":\"&LEFT(E27,1)","v":":"},"xxx",null,null,null,null,{"$f":"IF(I28=0,\"\",RANK(I28,$I$27:$I$31))","v":""}]
[3,null,null,{"$f":"RIGHT(F27,1)&\":\"&LEFT(F27,1)","v":":"},{"$f":"RIGHT(F28,1)&\":\"&LEFT(F28,1)","v":":"},"xxx"]
[4,null,null,{"$f":"RIGHT(G27,1)&\":\"&LEFT(G27,1)","v":":"},{"$f":"RIGHT(G28,1)&\":\"&LEFT(G28,1)","v":":"},{"$f":"RIGHT(G29,1)&\":\"&LEFT(G29,1)","v":":"},"xxx",null,null,{"$f":"IF(I30=0,\"\",RANK(I30,$I$27:$I$31))","v":""}]
[5,null,null,{"$f":"RIGHT(H27,1)&\":\"&LEFT(H27,1)","v":":"},{"$f":"RIGHT(H28,1)&\":\"&LEFT(H28,1)","v":":"},{"$f":"RIGHT(H29,1)&\":\"&LEFT(H29,1)","v":":"},{"$f":"RIGHT(H30,1)&\":\"&LEFT(H30,1)","v":":"},"xxx",null,{"$f":"IF(I31=0,\"\",RANK(I31,$I$27:$I$31))","v":""}]

{"sheet":"div_5","index":9,"n_rows":31,"n_cols":10,"rows_kept":31,"cut":false,"hidden":true,"merged":[[26,1,26,2],[27,1,27,2],[28,1,28,2],[29,1,29,2],[30,1,30,2],[22,1,22,2],[23,1,23,2],[8,1,8,2],[9,1,9,2],[12,1,12,2],[13,1,13,2],[14,1,14,2],[15,1,15,2],[16,1,16,2],[19,1,19,2],[20,1,20,2],[21,1,21,2],[0,0,0,9],[2,0,2,3],[5,1,5,2],[6,1,6,2],[7,1,7,2],[3,0,3,2]]}
[{"$f":"A_skupiny!A1","v":"10. KBT Libereckého kraje"}]
[]
[{"$f":"A_skupiny!A3","v":"Turnov, 14.05.2022"}]
["Divize 54- základní skupiny"]
[null,"skupina I","škola/klub",1,2,3,4,5,"b","m"]
[1,null,null,"xxx"]
[2,null,null,{"$f":"RIGHT(E6,1)&\":\"&LEFT(E6,1)","v":":"},"xxx"]
[3,null,null,{"$f":"RIGHT(F6,1)&\":\"&LEFT(F6,1)","v":":"},{"$f":"RIGHT(F7,1)&\":\"&LEFT(F7,1)","v":":"},"xxx"]
[4,null,null,{"$f":"RIGHT(G6,1)&\":\"&LEFT(G6,1)","v":":"},{"$f":"RIGHT(G7,1)&\":\"&LEFT(G7,1)","v":":"},{"$f":"RIGHT(G8,1)&\":\"&LEFT(G8,1)","v":":"},"xxx"]
[5,null,null,{"$f":"RIGHT(H6,1)&\":\"&LEFT(H6,1)","v":":"},{"$f":"RIGHT(H7,1)&\":\"&LEFT(H7,1)","v":":"},{"$f":"RIGHT(H8,1)&\":\"&LEFT(H8,1)","v":":"},{"$f":"RIGHT(H9,1)&\":\"&LEFT(H9,1)","v":":"},"xxx"]
[]
[null,"skupina J","škola/klub",1,2,3,4,5,"b","m"]
[1,null,null,"xxx"]
[2,null,null,{"$f":"RIGHT(E13,1)&\":\"&LEFT(E13,1)","v":":"},"xxx"]
[3,null,null,{"$f":"RIGHT(F13,1)&\":\"&LEFT(F13,1)","v":":"},{"$f":"RIGHT(F14,1)&\":\"&LEFT(F14,1)","v":":"},"xxx"]
[4,null,null,{"$f":"RIGHT(G13,1)&\":\"&LEFT(G13,1)","v":":"},{"$f":"RIGHT(G14,1)&\":\"&LEFT(G14,1)","v":":"},{"$f":"RIGHT(G15,1)&\":\"&LEFT(G15,1)","v":":"},"xxx"]
[5,null,null,{"$f":"RIGHT(H13,1)&\":\"&LEFT(H13,1)","v":":"},{"$f":"RIGHT(H14,1)&\":\"&LEFT(H14,1)","v":":"},{"$f":"RIGHT(H15,1)&\":\"&LEFT(H15,1)","v":":"},{"$f":"RIGHT(H16,1)&\":\"&LEFT(H16,1)","v":":"},"xxx"]
[]
[null,"skupina K","škola/klub",1,2,3,4,5,"b","m"]
[1,null,null,"xxx",null,null,null,null,null,{"$f":"IF(I20=0,\"\",RANK(I20,$I$20:$I$24))","v":""}]
[2,null,null,{"$f":"RIGHT(E20,1)&\":\"&LEFT(E20,1)","v":":"},"xxx",null,null,null,null,{"$f":"IF(I21=0,\"\",RANK(I21,$I$20:$I$24))","v":""}]
[3,null,null,{"$f":"RIGHT(F20,1)&\":\"&LEFT(F20,1)","v":":"},{"$f":"RIGHT(F21,1)&\":\"&LEFT(F21,1)","v":":"},"xxx"]
[4,null,null,{"$f":"RIGHT(G20,1)&\":\"&LEFT(G20,1)","v":":"},{"$f":"RIGHT(G21,1)&\":\"&LEFT(G21,1)","v":":"},{"$f":"RIGHT(G22,1)&\":\"&LEFT(G22,1)","v":":"},"xxx",null,null,{"$f":"IF(I23=0,\"\",RANK(I23,$I$20:$I$24))","v":""}]
[5,null,null,{"$f":"RIGHT(H20,1)&\":\"&LEFT(H20,1)","v":":"},{"$f":"RIGHT(H21,1)&\":\"&LEFT(H21,1)","v":":"},{"$f":"RIGHT(H22,1)&\":\"&LEFT(H22,1)","v":":"},{"$f":"RIGHT(H23,1)&\":\"&LEFT(H23,1)","v":":"},"xxx",null,{"$f":"IF(I24=0,\"\",RANK(I24,$I$20:$I$24))","v":""}]
[]
[null,"skupina L","škola/klub",1,2,3,4,5,"b","m"]
[1,null,null,"xxx",null,null,null,null,{"$f":"IF(B27=\"\",0,IF(E27=\"\",0,IF(OR(LEFT(E27,1)=\"w\",VALUE(LEFT(E27,1))>VALUE(RIGHT(E27,1))),2,IF(OR(VALUE(LEFT(E27,1))<VALUE(RIGHT(E27,1))),1,0)))+IF(F27=\"\",0,IF(OR(LEFT(F27,1)=\"w\",VALUE(LEFT(F27,1))>VALUE(RIGHT(F27,1))),2,IF(OR(VALUE(LEFT(F27,1))<VALUE(RIGHT(F27,1))),1,0)))+IF(G27=\"\",0,IF(OR(LEFT(G27,1)=\"w\",VALUE(LEFT(G27,1))>VALUE(RIGHT(G27,1))),2,IF(OR(VALUE(LEFT(G27,1))<VALUE(RIGHT(G27,1))),1,0)))+IF(H27=\"\",0,IF(OR(LEFT(H27,1)=\"w\",VALUE(LEFT(H27,1))>VALUE(RIGHT(H27,1))),2,IF(OR(VALUE(LEFT(H27,1))<VALUE(RIGHT(H27,1))),1,0))))","v":0},{"$f":"IF(I27=0,\"\",RANK(I27,$I$27:$I$31))","v":""}]
[2,null,null,{"$f":"RIGHT(E27,1)&\":\"&LEFT(E27,1)","v":":"},"xxx",null,null,null,{"$f":"IF(B28=\"\",0,IF(D28=\"\",0,IF(OR(LEFT(D28,1)=\"w\",VALUE(LEFT(D28,1))>VALUE(RIGHT(D28,1))),2,IF(OR(VALUE(LEFT(D28,1))<VALUE(RIGHT(D28,1))),1,0)))+IF(F28=\"\",0,IF(OR(LEFT(F28,1)=\"w\",VALUE(LEFT(F28,1))>VALUE(RIGHT(F28,1))),2,IF(OR(VALUE(LEFT(F28,1))<VALUE(RIGHT(F28,1))),1,0)))+IF(G28=\"\",0,IF(OR(LEFT(G28,1)=\"w\",VALUE(LEFT(G28,1))>VALUE(RIGHT(G28,1))),2,IF(OR(VALUE(LEFT(G28,1))<VALUE(RIGHT(G28,1))),1,0)))+IF(H28=\"\",0,IF(OR(LEFT(H28,1)=\"w\",VALUE(LEFT(H28,1))>VALUE(RIGHT(H28,1))),2,IF(OR(VALUE(LEFT(H28,1))<VALUE(RIGHT(H28,1))),1,0))))","v":0},{"$f":"IF(I28=0,\"\",RANK(I28,$I$27:$I$31))","v":""}]
[3,null,null,{"$f":"RIGHT(F27,1)&\":\"&LEFT(F27,1)","v":":"},{"$f":"RIGHT(F28,1)&\":\"&LEFT(F28,1)","v":":"},"xxx",null,null,{"$f":"IF(B29=\"\",0,IF(D29=\"\",0,IF(OR(LEFT(D29,1)=\"w\",VALUE(LEFT(D29,1))>VALUE(RIGHT(D29,1))),2,IF(OR(VALUE(LEFT(D29,1))<VALUE(RIGHT(D29,1))),1,0)))+IF(E29=\"\",0,IF(OR(LEFT(E29,1)=\"w\",VALUE(LEFT(E29,1))>VALUE(RIGHT(E29,1))),2,IF(OR(VALUE(LEFT(E29,1))<VALUE(RIGHT(E29,1))),1,0)))+IF(G29=\"\",0,IF(OR(LEFT(G29,1)=\"w\",VALUE(LEFT(G29,1))>VALUE(RIGHT(G29,1))),2,IF(OR(VALUE(LEFT(G29,1))<VALUE(RIGHT(G29,1))),1,0)))+IF(H29=\"\",0,IF(OR(LEFT(H29,1)=\"w\",VALUE(LEFT(H29,1))>VALUE(RIGHT(H29,1))),2,IF(OR(VALUE(LEFT(H29,1))<VALUE(RIGHT(H29,1))),1,0))))","v":0}]
[4,null,null,{"$f":"RIGHT(G27,1)&\":\"&LEFT(G27,1)","v":":"},{"$f":"RIGHT(G28,1)&\":\"&LEFT(G28,1)","v":":"},{"$f":"RIGHT(G29,1)&\":\"&LEFT(G29,1)","v":":"},"xxx",null,{"$f":"IF(B30=\"\",0,IF(D30=\"\",0,IF(OR(LEFT(D30,1)=\"w\",VALUE(LEFT(D30,1))>VALUE(RIGHT(D30,1))),2,IF(OR(VALUE(LEFT(D30,1))<VALUE(RIGHT(D30,1))),1,0)))+IF(E30=\"\",0,IF(OR(LEFT(E30,1)=\"w\",VALUE(LEFT(E30,1))>VALUE(RIGHT(E30,1))),2,IF(OR(VALUE(LEFT(E30,1))<VALUE(RIGHT(E30,1))),1,0)))+IF(F30=\"\",0,IF(OR(LEFT(F30,1)=\"w\",VALUE(LEFT(F30,1))>VALUE(RIGHT(F30,1))),2,IF(OR(VALUE(LEFT(F30,1))<VALUE(RIGHT(F30,1))),1,0)))+IF(H30=\"\",0,IF(OR(LEFT(H30,1)=\"w\",VALUE(LEFT(H30,1))>VALUE(RIGHT(H30,1))),2,IF(OR(VALUE(LEFT(H30,1))<VALUE(RIGHT(H30,1))),1,0))))","v":0},{"$f":"IF(I30=0,\"\",RANK(I30,$I$27:$I$31))","v":""}]
[5,null,null,{"$f":"RIGHT(H27,1)&\":\"&LEFT(H27,1)","v":":"},{"$f":"RIGHT(H28,1)&\":\"&LEFT(H28,1)","v":":"},{"$f":"RIGHT(H29,1)&\":\"&LEFT(H29,1)","v":":"},{"$f":"RIGHT(H30,1)&\":\"&LEFT(H30,1)","v":":"},"xxx",{"$f":"IF(B31=\"\",0,IF(D31=\"\",0,IF(OR(LEFT(D31,1)=\"w\",VALUE(LEFT(D31,1))>VALUE(RIGHT(D31,1))),2,IF(OR(VALUE(LEFT(D31,1))<VALUE(RIGHT(D31,1))),1,0)))+IF(E31=\"\",0,IF(OR(LEFT(E31,1)=\"w\",VALUE(LEFT(E31,1))>VALUE(RIGHT(E31,1))),2,IF(OR(VALUE(LEFT(E31,1))<VALUE(RIGHT(E31,1))),1,0)))+IF(F31=\"\",0,IF(OR(LEFT(F31,1)=\"w\",VALUE(LEFT(F31,1))>VALUE(RIGHT(F31,1))),2,IF(OR(VALUE(LEFT(F31,1))<VALUE(RIGHT(F31,1))),1,0)))+IF(G31=\"\",0,IF(OR(LEFT(G31,1)=\"w\",VALUE(LEFT(G31,1))>VALUE(RIGHT(G31,1))),2,IF(OR(VALUE(LEFT(G31,1))<VALUE(RIGHT(G31,1))),1,0))))","v":0},{"$f":"IF(I31=0,\"\",RANK(I31,$I$27:$I$31))","v":""}]

{"sheet":"1divize-A","index":10,"n_rows":44,"n_cols":5,"rows_kept":44,"cut":false,"hidden":true,"merged":[[0,1,0,4],[1,1,1,4],[2,1,2,4]]}
["Název souteže:",{"$f":"A_skupiny!A1","v":"10. KBT Libereckého kraje"}]
["Kategorie, den",{"$f":"A_skupiny!A3","v":"Turnov, 14.05.2022"}]
["Kolo","1. divize - kollo vítězů"]
[null,null,null,"výsledek","wo"]
["o 1.-8. místo"]
["Nohejl Václav    (ST Frýdlant) - U17",null,"Kos Vincent    (SKST Liberec) - U13","3:0"]
["Němec Štěpán    (SKST Liberec) - U15",null,"Wolf Filip  (SKST Liberec) - U15","0:3"]
["Vogel Jakub    (SKST Liberec) - U17",null,"Gabriel Jan  (Loko Česká Lípa) - U15","3:1"]
["Harries Charlie  (SKST Liberec) - U15",null,"Žmuda Petr  (SKST Liberec) - U15","0:3"]
["o 5.-8. místo"]
[{"$f":"IF(AND($D6=\"\",$A6=\"\",$C6=\"\"),\"\",IF(AND($A6=\"\",$C6<>\"\"),$C6,IF(AND($A6<>\"\",$C6=\"\"),$A6,IF($D6=\"\",\"\",IF(LEFT($D6,1)<RIGHT($D6,1),$A6,$C6)))))","v":"Kos Vincent    (SKST Liberec) - U13"},null,{"$f":"IF(AND($D7=\"\",$A7=\"\",$C7=\"\"),\"\",IF(AND($A7=\"\",$C7<>\"\"),$C7,IF(AND($A7<>\"\",$C7=\"\"),$A7,IF($D7=\"\",\"\",IF(LEFT($D7,1)<RIGHT($D7,1),$A7,$C7)))))","v":"Němec Štěpán    (SKST Liberec) - U15"},"0:3"]
[{"$f":"IF(AND($D8=\"\",$A8=\"\",$C8=\"\"),\"\",IF(AND($A8=\"\",$C8<>\"\"),$C8,IF(AND($A8<>\"\",$C8=\"\"),$A8,IF($D8=\"\",\"\",IF(LEFT($D8,1)<RIGHT($D8,1),$A8,$C8)))))","v":"Gabriel Jan  (Loko Česká Lípa) - U15"},null,{"$f":"IF(AND($D9=\"\",$A9=\"\",$C9=\"\"),\"\",IF(AND($A9=\"\",$C9<>\"\"),$C9,IF(AND($A9<>\"\",$C9=\"\"),$A9,IF($D9=\"\",\"\",IF(LEFT($D9,1)<RIGHT($D9,1),$A9,$C9)))))","v":"Harries Charlie  (SKST Liberec) - U15"},"2:3"]
["o 3.-4. místo"]
[{"$f":"IF($D18=\"\",\"\",IF(AND($A18=\"\",$C18<>\"\"),C18,IF(AND($A18<>\"\",$C18=\"\"),A18,IF(AND($A18=\"\",$C18=\"\"),\"\",IF(LEFT($D18,1)<RIGHT($D18,1),A18,C18)))))","v":"Nohejl Václav    (ST Frýdlant) - U17"},null,{"$f":"IF($D19=\"\",\"\",IF(AND($A19=\"\",$C19<>\"\"),$C19,IF(AND($A19<>\"\",$C19=\"\"),$A19,IF(AND($A19=\"\",$C19=\"\"),\"\",IF(LEFT($D19,1)<RIGHT($D19,1),$A19,$C19)))))","v":"Žmuda Petr  (SKST Liberec) - U15"},"0:3"]
["o 7.-8. místo"]
[{"$f":"IF(AND($D11=\"\",$A11=\"\",$C11=\"\"),\"\",IF(AND($A11=\"\",$C11<>\"\"),$C11,IF(AND($A11<>\"\",$C11=\"\"),$A11,IF(AND($A11=\"\",$C11=\"\"),\"\",IF(LEFT($D11,1)<RIGHT($D11,1),$A11,$C11)))))","v":"Kos Vincent    (SKST Liberec) - U13"},null,{"$f":"IF(AND($D12=\"\",$A12=\"\",$C12=\"\"),\"\",IF(AND($A12=\"\",$C12<>\"\"),$C12,IF(AND($A12<>\"\",$C12=\"\"),$A12,IF(AND($A12=\"\",$C12=\"\"),\"\",IF(LEFT($D12,1)<RIGHT($D12,1),$A12,$C12)))))","v":"Gabriel Jan  (Loko Česká Lípa) - U15"},"1:3"]
["o 1.-4. místo"]
[{"$f":"IF(AND($D6=\"\",$A6=\"\",$C6=\"\"),\"\",IF(AND($A6=\"\",$C6<>\"\"),$C6,IF(AND($A6<>\"\",$C6=\"\"),$A6,IF($D6=\"\",\"\",IF(LEFT($D6,1)>RIGHT($D6,1),$A6,$C6)))))","v":"Nohejl Václav    (ST Frýdlant) - U17"},null,{"$f":"IF(AND($D7=\"\",$A7=\"\",$C7=\"\"),\"\",IF(AND($A7=\"\",$C7<>\"\"),$C7,IF(AND($A7<>\"\",$C7=\"\"),$A7,IF($D7=\"\",\"\",IF(LEFT($D7,1)>RIGHT($D7,1),$A7,$C7)))))","v":"Wolf Filip  (SKST Liberec) - U15"},"1:3"]
[{"$f":"IF(AND($D8=\"\",$A8=\"\",$C8=\"\"),\"\",IF(AND($A8=\"\",$C8<>\"\"),$C8,IF(AND($A8<>\"\",$C8=\"\"),$A8,IF($D8=\"\",\"\",IF(LEFT($D8,1)>RIGHT($D8,1),$A8,$C8)))))","v":"Vogel Jakub    (SKST Liberec) - U17"},null,{"$f":"IF(AND($D9=\"\",$A9=\"\",$C9=\"\"),\"\",IF(AND($A9=\"\",$C9<>\"\"),$C9,IF(AND($A9<>\"\",$C9=\"\"),$A9,IF($D9=\"\",\"\",IF(LEFT($D9,1)>RIGHT($D9,1),$A9,$C9)))))","v":"Žmuda Petr  (SKST Liberec) - U15"},"3:0"]
["o 5.-6. místo"]
[{"$f":"IF(AND($D11=\"\",$A11=\"\",$C11=\"\"),\"\",IF(AND($A11=\"\",$C11<>\"\"),$C11,IF(AND($A11<>\"\",$C11=\"\"),$A11,IF(AND($A11=\"\",$C11=\"\"),\"\",IF(LEFT($D11,1)>RIGHT($D11,1),$A11,$C11)))))","v":"Němec Štěpán    (SKST Liberec) - U15"},null,{"$f":"IF(AND($D12=\"\",$A12=\"\",$C12=\"\"),\"\",IF(AND($A12=\"\",$C12<>\"\"),$C12,IF(AND($A12<>\"\",$C12=\"\"),$A12,IF(AND($A12=\"\",$C12=\"\"),\"\",IF(LEFT($D12,1)>RIGHT($D12,1),$A12,$C12)))))","v":"Harries Charlie  (SKST Liberec) - U15"},"2:3"]
["o 1.-2. místo"]
[{"$f":"IF($D18=\"\",\"\",IF(AND($A18=\"\",$C18<>\"\"),C18,IF(AND($A18<>\"\",$C18=\"\"),A18,IF(AND($A18=\"\",$C18=\"\"),\"\",IF(LEFT($D18,1)>RIGHT($D18,1),A18,C18)))))","v":"Wolf Filip  (SKST Liberec) - U15"},null,{"$f":"IF($D19=\"\",\"\",IF(AND($A19=\"\",$C19<>\"\"),$C19,IF(AND($A19<>\"\",$C19=\"\"),$A19,IF(AND($A19=\"\",$C19=\"\"),\"\",IF(LEFT($D19,1)>RIGHT($D19,1),$A19,$C19)))))","v":"Vogel Jakub    (SKST Liberec) - U17"},"2:3"]
[{"$f":"IF($D23=\"\",\"\",IF(AND($A23=\"\",$C23<>\"\"),C23,IF(AND($A23<>\"\",$C23=\"\"),A23,IF(AND($A23=\"\",$C23=\"\"),\"\",IF(LEFT($D23,1)>RIGHT($D23,1),A23,C23)))))","v":"Vogel Jakub    (SKST Liberec) - U17"},null,"1. místo"]
[{"$f":"IF($D23=\"\",\"\",IF(AND($A23=\"\",$C23<>\"\"),C23,IF(AND($A23<>\"\",$C23=\"\"),A23,IF(AND($A23=\"\",$C23=\"\"),\"\",IF(LEFT($D23,1)<RIGHT($D23,1),A23,C23)))))","v":"Wolf Filip  (SKST Liberec) - U15"},null,"2. místo"]
[{"$f":"IF(AND($D14=\"\",$A14=\"\",$C14=\"\"),\"\",IF(AND($A14=\"\",$C14<>\"\"),$C14,IF(AND($A14<>\"\",$C14=\"\"),$A14,IF(AND($A14=\"\",$C14=\"\"),\"\",IF(LEFT($D14,1)>RIGHT($D14,1),$A14,$C14)))))","v":"Žmuda Petr  (SKST Liberec) - U15"},null,"3. místo"]
[{"$f":"IF(AND($D14=\"\",$A14=\"\",$C14=\"\"),\"\",IF(AND($A14=\"\",$C14<>\"\"),$C14,IF(AND($A14<>\"\",$C14=\"\"),$A14,IF(AND($A14=\"\",$C14=\"\"),\"\",IF(LEFT($D14,1)<RIGHT($D14,1),$A14,$C14)))))","v":"Nohejl Václav    (ST Frýdlant) - U17"},null,"4. místo"]
[{"$f":"IF(AND($D21=\"\",$A21=\"\",$C21=\"\"),\"\",IF(AND($A21=\"\",$C21<>\"\"),$C21,IF(AND($A21<>\"\",$C21=\"\"),$A21,IF(AND($A21=\"\",$C21=\"\"),\"\",IF(LEFT($D21,1)>RIGHT($D21,1),$A21,$C21)))))","v":"Harries Charlie  (SKST Liberec) - U15"},null,"5. místo"]
[{"$f":"IF(AND($D21=\"\",$A21=\"\",$C21=\"\"),\"\",IF(AND($A21=\"\",$C21<>\"\"),$C21,IF(AND($A21<>\"\",$C21=\"\"),$A21,IF(AND($A21=\"\",$C21=\"\"),\"\",IF(LEFT($D21,1)<RIGHT($D21,1),$A21,$C21)))))","v":"Němec Štěpán    (SKST Liberec) - U15"},null,"6. místo"]
[{"$f":"IF(AND($D16=\"\",$A16=\"\",$C16=\"\"),\"\",IF(AND($A16=\"\",$C16<>\"\"),$C16,IF(AND($A16<>\"\",$C16=\"\"),$A16,IF(AND($A16=\"\",$C16=\"\"),\"\",IF(LEFT($D16,1)>RIGHT($D16,1),$A16,$C16)))))","v":"Gabriel Jan  (Loko Česká Lípa) - U15"},null,"7. místo"]
[{"$f":"IF(AND($D16=\"\",$A16=\"\",$C16=\"\"),\"\",IF(AND($A16=\"\",$C16<>\"\"),$C16,IF(AND($A16<>\"\",$C16=\"\"),$A16,IF(AND($A16=\"\",$C16=\"\"),\"\",IF(LEFT($D16,1)<RIGHT($D16,1),$A16,$C16)))))","v":"Kos Vincent    (SKST Liberec) - U13"},null,"8. místo"]
[]
[]
[]
[]
[]
[]
[]
[]
[]
[]
[]
[]
[null,null,null,"."]

{"sheet":"1divize-B","index":11,"n_rows":44,"n_cols":5,"rows_kept":44,"cut":false,"hidden":true,"merged":[[0,1,0,4],[1,1,1,4],[2,1,2,4]]}
["Název souteže:",{"$f":"A_skupiny!A1","v":"10. KBT Libereckého kraje"}]
["Kategorie, den",{"$f":"A_skupiny!A3","v":"Turnov, 14.05.2022"}]
["Kolo","1. divize - o 9. - 16. místo"]
[null,null,null,"výsledek","wo"]
["o 9.-16. místo"]
["Kahan Ondřej   (SKST Liberec) - U15",null,"Holasová Sofie    (SKST Liberec) - U15","3:1"]
["Nohejl Martin   (ST Frýdlant) - U17",null,"Brunclík Jan    (Spartak Smržovka) - U17","3:0"]
["Jandák Jan    (SKST Liberec) - U19",null,"Nechvíl Richard    (STAR Turnov) - U15","3:2"]
["Vyhlídko Jan   (Spartak Smržovka) - U17",null,"Černohub Vít    (Jiskra Nový Bor) - U13","1:3"]
["o 13.-16. místo"]
[{"$f":"IF(AND($D6=\"\",$A6=\"\",$C6=\"\"),\"\",IF(AND($A6=\"\",$C6<>\"\"),$C6,IF(AND($A6<>\"\",$C6=\"\"),$A6,IF($D6=\"\",\"\",IF(LEFT($D6,1)<RIGHT($D6,1),$A6,$C6)))))","v":"Holasová Sofie    (SKST Liberec) - U15"},null,{"$f":"IF(AND($D7=\"\",$A7=\"\",$C7=\"\"),\"\",IF(AND($A7=\"\",$C7<>\"\"),$C7,IF(AND($A7<>\"\",$C7=\"\"),$A7,IF($D7=\"\",\"\",IF(LEFT($D7,1)<RIGHT($D7,1),$A7,$C7)))))","v":"Brunclík Jan    (Spartak Smržovka) - U17"},"2:3"]
[{"$f":"IF(AND($D8=\"\",$A8=\"\",$C8=\"\"),\"\",IF(AND($A8=\"\",$C8<>\"\"),$C8,IF(AND($A8<>\"\",$C8=\"\"),$A8,IF($D8=\"\",\"\",IF(LEFT($D8,1)<RIGHT($D8,1),$A8,$C8)))))","v":"Nechvíl Richard    (STAR Turnov) - U15"},null,{"$f":"IF(AND($D9=\"\",$A9=\"\",$C9=\"\"),\"\",IF(AND($A9=\"\",$C9<>\"\"),$C9,IF(AND($A9<>\"\",$C9=\"\"),$A9,IF($D9=\"\",\"\",IF(LEFT($D9,1)<RIGHT($D9,1),$A9,$C9)))))","v":"Vyhlídko Jan   (Spartak Smržovka) - U17"},"3:1"]
["o 11.-12. místo"]
[{"$f":"IF($D18=\"\",\"\",IF(AND($A18=\"\",$C18<>\"\"),C18,IF(AND($A18<>\"\",$C18=\"\"),A18,IF(AND($A18=\"\",$C18=\"\"),\"\",IF(LEFT($D18,1)<RIGHT($D18,1),A18,C18)))))","v":"Nohejl Martin   (ST Frýdlant) - U17"},null,{"$f":"IF($D19=\"\",\"\",IF(AND($A19=\"\",$C19<>\"\"),$C19,IF(AND($A19<>\"\",$C19=\"\"),$A19,IF(AND($A19=\"\",$C19=\"\"),\"\",IF(LEFT($D19,1)<RIGHT($D19,1),$A19,$C19)))))","v":"Černohub Vít    (Jiskra Nový Bor) - U13"},"3:0"]
["o 15.-16. místo"]
[{"$f":"IF(AND($D11=\"\",$A11=\"\",$C11=\"\"),\"\",IF(AND($A11=\"\",$C11<>\"\"),$C11,IF(AND($A11<>\"\",$C11=\"\"),$A11,IF(AND($A11=\"\",$C11=\"\"),\"\",IF(LEFT($D11,1)<RIGHT($D11,1),$A11,$C11)))))","v":"Holasová Sofie    (SKST Liberec) - U15"},null,{"$f":"IF(AND($D12=\"\",$A12=\"\",$C12=\"\"),\"\",IF(AND($A12=\"\",$C12<>\"\"),$C12,IF(AND($A12<>\"\",$C12=\"\"),$A12,IF(AND($A12=\"\",$C12=\"\"),\"\",IF(LEFT($D12,1)<RIGHT($D12,1),$A12,$C12)))))","v":"Vyhlídko Jan   (Spartak Smržovka) - U17"},"0:3"]
["o 9.-12. místo"]
[{"$f":"IF(AND($D6=\"\",$A6=\"\",$C6=\"\"),\"\",IF(AND($A6=\"\",$C6<>\"\"),$C6,IF(AND($A6<>\"\",$C6=\"\"),$A6,IF($D6=\"\",\"\",IF(LEFT($D6,1)>RIGHT($D6,1),$A6,$C6)))))","v":"Kahan Ondřej   (SKST Liberec) - U15"},null,{"$f":"IF(AND($D7=\"\",$A7=\"\",$C7=\"\"),\"\",IF(AND($A7=\"\",$C7<>\"\"),$C7,IF(AND($A7<>\"\",$C7=\"\"),$A7,IF($D7=\"\",\"\",IF(LEFT($D7,1)>RIGHT($D7,1),$A7,$C7)))))","v":"Nohejl Martin   (ST Frýdlant) - U17"},"3:1"]
[{"$f":"IF(AND($D8=\"\",$A8=\"\",$C8=\"\"),\"\",IF(AND($A8=\"\",$C8<>\"\"),$C8,IF(AND($A8<>\"\",$C8=\"\"),$A8,IF($D8=\"\",\"\",IF(LEFT($D8,1)>RIGHT($D8,1),$A8,$C8)))))","v":"Jandák Jan    (SKST Liberec) - U19"},null,{"$f":"IF(AND($D9=\"\",$A9=\"\",$C9=\"\"),\"\",IF(AND($A9=\"\",$C9<>\"\"),$C9,IF(AND($A9<>\"\",$C9=\"\"),$A9,IF($D9=\"\",\"\",IF(LEFT($D9,1)>RIGHT($D9,1),$A9,$C9)))))","v":"Černohub Vít    (Jiskra Nový Bor) - U13"},"3:1"]
["13.-14. místo"]
[{"$f":"IF(AND($D11=\"\",$A11=\"\",$C11=\"\"),\"\",IF(AND($A11=\"\",$C11<>\"\"),$C11,IF(AND($A11<>\"\",$C11=\"\"),$A11,IF(AND($A11=\"\",$C11=\"\"),\"\",IF(LEFT($D11,1)>RIGHT($D11,1),$A11,$C11)))))","v":"Brunclík Jan    (Spartak Smržovka) - U17"},null,{"$f":"IF(AND($D12=\"\",$A12=\"\",$C12=\"\"),\"\",IF(AND($A12=\"\",$C12<>\"\"),$C12,IF(AND($A12<>\"\",$C12=\"\"),$A12,IF(AND($A12=\"\",$C12=\"\"),\"\",IF(LEFT($D12,1)>RIGHT($D12,1),$A12,$C12)))))","v":"Nechvíl Richard    (STAR Turnov) - U15"},"0:3"]
["o 9.-10. místo"]
[{"$f":"IF($D18=\"\",\"\",IF(AND($A18=\"\",$C18<>\"\"),C18,IF(AND($A18<>\"\",$C18=\"\"),A18,IF(AND($A18=\"\",$C18=\"\"),\"\",IF(LEFT($D18,1)>RIGHT($D18,1),A18,C18)))))","v":"Kahan Ondřej   (SKST Liberec) - U15"},null,{"$f":"IF($D19=\"\",\"\",IF(AND($A19=\"\",$C19<>\"\"),$C19,IF(AND($A19<>\"\",$C19=\"\"),$A19,IF(AND($A19=\"\",$C19=\"\"),\"\",IF(LEFT($D19,1)>RIGHT($D19,1),$A19,$C19)))))","v":"Jandák Jan    (SKST Liberec) - U19"},"1:3"]
[{"$f":"IF($D23=\"\",\"\",IF(AND($A23=\"\",$C23<>\"\"),C23,IF(AND($A23<>\"\",$C23=\"\"),A23,IF(AND($A23=\"\",$C23=\"\"),\"\",IF(LEFT($D23,1)>RIGHT($D23,1),A23,C23)))))","v":"Jandák Jan    (SKST Liberec) - U19"},null,"9. místo"]
[{"$f":"IF($D23=\"\",\"\",IF(AND($A23=\"\",$C23<>\"\"),C23,IF(AND($A23<>\"\",$C23=\"\"),A23,IF(AND($A23=\"\",$C23=\"\"),\"\",IF(LEFT($D23,1)<RIGHT($D23,1),A23,C23)))))","v":"Kahan Ondřej   (SKST Liberec) - U15"},null,"10. místo"]
[{"$f":"IF(AND($D14=\"\",$A14=\"\",$C14=\"\"),\"\",IF(AND($A14=\"\",$C14<>\"\"),$C14,IF(AND($A14<>\"\",$C14=\"\"),$A14,IF(AND($A14=\"\",$C14=\"\"),\"\",IF(LEFT($D14,1)>RIGHT($D14,1),$A14,$C14)))))","v":"Nohejl Martin   (ST Frýdlant) - U17"},null,"11. místo"]
[{"$f":"IF(AND($D14=\"\",$A14=\"\",$C14=\"\"),\"\",IF(AND($A14=\"\",$C14<>\"\"),$C14,IF(AND($A14<>\"\",$C14=\"\"),$A14,IF(AND($A14=\"\",$C14=\"\"),\"\",IF(LEFT($D14,1)<RIGHT($D14,1),$A14,$C14)))))","v":"Černohub Vít    (Jiskra Nový Bor) - U13"},null,"12. místo"]
[{"$f":"IF(AND($D21=\"\",$A21=\"\",$C21=\"\"),\"\",IF(AND($A21=\"\",$C21<>\"\"),$C21,IF(AND($A21<>\"\",$C21=\"\"),$A21,IF(AND($A21=\"\",$C21=\"\"),\"\",IF(LEFT($D21,1)>RIGHT($D21,1),$A21,$C21)))))","v":"Nechvíl Richard    (STAR Turnov) - U15"},null,"13. místo"]
[{"$f":"IF(AND($D21=\"\",$A21=\"\",$C21=\"\"),\"\",IF(AND($A21=\"\",$C21<>\"\"),$C21,IF(AND($A21<>\"\",$C21=\"\"),$A21,IF(AND($A21=\"\",$C21=\"\"),\"\",IF(LEFT($D21,1)<RIGHT($D21,1),$A21,$C21)))))","v":"Brunclík Jan    (Spartak Smržovka) - U17"},null,"14. místo"]
[{"$f":"IF(AND($D16=\"\",$A16=\"\",$C16=\"\"),\"\",IF(AND($A16=\"\",$C16<>\"\"),$C16,IF(AND($A16<>\"\",$C16=\"\"),$A16,IF(AND($A16=\"\",$C16=\"\"),\"\",IF(LEFT($D16,1)>RIGHT($D16,1),$A16,$C16)))))","v":"Vyhlídko Jan   (Spartak Smržovka) - U17"},null,"15. místo"]
[{"$f":"IF(AND($D16=\"\",$A16=\"\",$C16=\"\"),\"\",IF(AND($A16=\"\",$C16<>\"\"),$C16,IF(AND($A16<>\"\",$C16=\"\"),$A16,IF(AND($A16=\"\",$C16=\"\"),\"\",IF(LEFT($D16,1)<RIGHT($D16,1),$A16,$C16)))))","v":"Holasová Sofie    (SKST Liberec) - U15"},null,"16. místo"]
[]
[]
[]
[]
[]
[]
[]
[]
[]
[]
[]
[]
[null,null,null,"."]

{"sheet":"2divize-A","index":12,"n_rows":44,"n_cols":5,"rows_kept":44,"cut":false,"hidden":true,"merged":[[0,1,0,4],[1,1,1,4],[2,1,2,4]]}
["Název souteže:",{"$f":"A_skupiny!A1","v":"10. KBT Libereckého kraje"}]
["Kategorie, den",{"$f":"A_skupiny!A3","v":"Turnov, 14.05.2022"}]
["Kolo","2. divize - o 1. - 8. místo"]
[null,null,null,"výsledek","wo"]
["o 1.-8.. místo"]
["Ortová Pavlína    (SKST Liberec) - U13",null,"Rek Vít    (Loko Česká Lípa) - U13","3:0"]
["Vrběcký Daniel    (B.  Jablonec n. N.) - U17",null,"Nováková Tereza    (Spartak Chrastava) - U17","0:3"]
["Rambousek Jan   (Spartak Chrastava) - U15",null,"Šedo Pavel   (KMST Liberec) - U17","0:3"]
["Csizmazia Antonín   (STAR Turnov) - U11",null,"Pytlounová Nikola   (SKST Liberec) - U15","3:0"]
["o 5.-8. místo"]
[{"$f":"IF(AND($D6=\"\",$A6=\"\",$C6=\"\"),\"\",IF(AND($A6=\"\",$C6<>\"\"),$C6,IF(AND($A6<>\"\",$C6=\"\"),$A6,IF($D6=\"\",\"\",IF(LEFT($D6,1)<RIGHT($D6,1),$A6,$C6)))))","v":"Rek Vít    (Loko Česká Lípa) - U13"},null,{"$f":"IF(AND($D7=\"\",$A7=\"\",$C7=\"\"),\"\",IF(AND($A7=\"\",$C7<>\"\"),$C7,IF(AND($A7<>\"\",$C7=\"\"),$A7,IF($D7=\"\",\"\",IF(LEFT($D7,1)<RIGHT($D7,1),$A7,$C7)))))","v":"Vrběcký Daniel    (B.  Jablonec n. N.) - U17"},"1:3"]
[{"$f":"IF(AND($D8=\"\",$A8=\"\",$C8=\"\"),\"\",IF(AND($A8=\"\",$C8<>\"\"),$C8,IF(AND($A8<>\"\",$C8=\"\"),$A8,IF($D8=\"\",\"\",IF(LEFT($D8,1)<RIGHT($D8,1),$A8,$C8)))))","v":"Rambousek Jan   (Spartak Chrastava) - U15"},null,{"$f":"IF(AND($D9=\"\",$A9=\"\",$C9=\"\"),\"\",IF(AND($A9=\"\",$C9<>\"\"),$C9,IF(AND($A9<>\"\",$C9=\"\"),$A9,IF($D9=\"\",\"\",IF(LEFT($D9,1)<RIGHT($D9,1),$A9,$C9)))))","v":"Pytlounová Nikola   (SKST Liberec) - U15"},"0:3"]
["o 3.-4. místo"]
[{"$f":"IF($D18=\"\",\"\",IF(AND($A18=\"\",$C18<>\"\"),C18,IF(AND($A18<>\"\",$C18=\"\"),A18,IF(AND($A18=\"\",$C18=\"\"),\"\",IF(LEFT($D18,1)<RIGHT($D18,1),A18,C18)))))","v":"Nováková Tereza    (Spartak Chrastava) - U17"},null,{"$f":"IF($D19=\"\",\"\",IF(AND($A19=\"\",$C19<>\"\"),$C19,IF(AND($A19<>\"\",$C19=\"\"),$A19,IF(AND($A19=\"\",$C19=\"\"),\"\",IF(LEFT($D19,1)<RIGHT($D19,1),$A19,$C19)))))","v":"Šedo Pavel   (KMST Liberec) - U17"},"2:3"]
["o 7.-8. místo"]
[{"$f":"IF(AND($D11=\"\",$A11=\"\",$C11=\"\"),\"\",IF(AND($A11=\"\",$C11<>\"\"),$C11,IF(AND($A11<>\"\",$C11=\"\"),$A11,IF(AND($A11=\"\",$C11=\"\"),\"\",IF(LEFT($D11,1)<RIGHT($D11,1),$A11,$C11)))))","v":"Rek Vít    (Loko Česká Lípa) - U13"},null,{"$f":"IF(AND($D12=\"\",$A12=\"\",$C12=\"\"),\"\",IF(AND($A12=\"\",$C12<>\"\"),$C12,IF(AND($A12<>\"\",$C12=\"\"),$A12,IF(AND($A12=\"\",$C12=\"\"),\"\",IF(LEFT($D12,1)<RIGHT($D12,1),$A12,$C12)))))","v":"Rambousek Jan   (Spartak Chrastava) - U15"},"0:3"]
["o 1.-4. místo"]
[{"$f":"IF(AND($D6=\"\",$A6=\"\",$C6=\"\"),\"\",IF(AND($A6=\"\",$C6<>\"\"),$C6,IF(AND($A6<>\"\",$C6=\"\"),$A6,IF($D6=\"\",\"\",IF(LEFT($D6,1)>RIGHT($D6,1),$A6,$C6)))))","v":"Ortová Pavlína    (SKST Liberec) - U13"},null,{"$f":"IF(AND($D7=\"\",$A7=\"\",$C7=\"\"),\"\",IF(AND($A7=\"\",$C7<>\"\"),$C7,IF(AND($A7<>\"\",$C7=\"\"),$A7,IF($D7=\"\",\"\",IF(LEFT($D7,1)>RIGHT($D7,1),$A7,$C7)))))","v":"Nováková Tereza    (Spartak Chrastava) - U17"},"3:0"]
[{"$f":"IF(AND($D8=\"\",$A8=\"\",$C8=\"\"),\"\",IF(AND($A8=\"\",$C8<>\"\"),$C8,IF(AND($A8<>\"\",$C8=\"\"),$A8,IF($D8=\"\",\"\",IF(LEFT($D8,1)>RIGHT($D8,1),$A8,$C8)))))","v":"Šedo Pavel   (KMST Liberec) - U17"},null,{"$f":"IF(AND($D9=\"\",$A9=\"\",$C9=\"\"),\"\",IF(AND($A9=\"\",$C9<>\"\"),$C9,IF(AND($A9<>\"\",$C9=\"\"),$A9,IF($D9=\"\",\"\",IF(LEFT($D9,1)>RIGHT($D9,1),$A9,$C9)))))","v":"Csizmazia Antonín   (STAR Turnov) - U11"},"1:3"]
["5.-6. místo"]
[{"$f":"IF(AND($D11=\"\",$A11=\"\",$C11=\"\"),\"\",IF(AND($A11=\"\",$C11<>\"\"),$C11,IF(AND($A11<>\"\",$C11=\"\"),$A11,IF(AND($A11=\"\",$C11=\"\"),\"\",IF(LEFT($D11,1)>RIGHT($D11,1),$A11,$C11)))))","v":"Vrběcký Daniel    (B.  Jablonec n. N.) - U17"},null,{"$f":"IF(AND($D12=\"\",$A12=\"\",$C12=\"\"),\"\",IF(AND($A12=\"\",$C12<>\"\"),$C12,IF(AND($A12<>\"\",$C12=\"\"),$A12,IF(AND($A12=\"\",$C12=\"\"),\"\",IF(LEFT($D12,1)>RIGHT($D12,1),$A12,$C12)))))","v":"Pytlounová Nikola   (SKST Liberec) - U15"},"0:3"]
["o 1.-2 místo"]
[{"$f":"IF($D18=\"\",\"\",IF(AND($A18=\"\",$C18<>\"\"),C18,IF(AND($A18<>\"\",$C18=\"\"),A18,IF(AND($A18=\"\",$C18=\"\"),\"\",IF(LEFT($D18,1)>RIGHT($D18,1),A18,C18)))))","v":"Ortová Pavlína    (SKST Liberec) - U13"},null,{"$f":"IF($D19=\"\",\"\",IF(AND($A19=\"\",$C19<>\"\"),$C19,IF(AND($A19<>\"\",$C19=\"\"),$A19,IF(AND($A19=\"\",$C19=\"\"),\"\",IF(LEFT($D19,1)>RIGHT($D19,1),$A19,$C19)))))","v":"Csizmazia Antonín   (STAR Turnov) - U11"},"3:1"]
[{"$f":"IF($D23=\"\",\"\",IF(AND($A23=\"\",$C23<>\"\"),C23,IF(AND($A23<>\"\",$C23=\"\"),A23,IF(AND($A23=\"\",$C23=\"\"),\"\",IF(LEFT($D23,1)>RIGHT($D23,1),A23,C23)))))","v":"Ortová Pavlína    (SKST Liberec) - U13"},null,"1. místo"]
[{"$f":"IF($D23=\"\",\"\",IF(AND($A23=\"\",$C23<>\"\"),C23,IF(AND($A23<>\"\",$C23=\"\"),A23,IF(AND($A23=\"\",$C23=\"\"),\"\",IF(LEFT($D23,1)<RIGHT($D23,1),A23,C23)))))","v":"Csizmazia Antonín   (STAR Turnov) - U11"},null,"2. místo"]
[{"$f":"IF(AND($D14=\"\",$A14=\"\",$C14=\"\"),\"\",IF(AND($A14=\"\",$C14<>\"\"),$C14,IF(AND($A14<>\"\",$C14=\"\"),$A14,IF(AND($A14=\"\",$C14=\"\"),\"\",IF(LEFT($D14,1)>RIGHT($D14,1),$A14,$C14)))))","v":"Šedo Pavel   (KMST Liberec) - U17"},null,"3. místo"]
[{"$f":"IF(AND($D14=\"\",$A14=\"\",$C14=\"\"),\"\",IF(AND($A14=\"\",$C14<>\"\"),$C14,IF(AND($A14<>\"\",$C14=\"\"),$A14,IF(AND($A14=\"\",$C14=\"\"),\"\",IF(LEFT($D14,1)<RIGHT($D14,1),$A14,$C14)))))","v":"Nováková Tereza    (Spartak Chrastava) - U17"},null,"4. místo"]
[{"$f":"IF(AND($D21=\"\",$A21=\"\",$C21=\"\"),\"\",IF(AND($A21=\"\",$C21<>\"\"),$C21,IF(AND($A21<>\"\",$C21=\"\"),$A21,IF(AND($A21=\"\",$C21=\"\"),\"\",IF(LEFT($D21,1)>RIGHT($D21,1),$A21,$C21)))))","v":"Pytlounová Nikola   (SKST Liberec) - U15"},null,"5. místo"]
[{"$f":"IF(AND($D21=\"\",$A21=\"\",$C21=\"\"),\"\",IF(AND($A21=\"\",$C21<>\"\"),$C21,IF(AND($A21<>\"\",$C21=\"\"),$A21,IF(AND($A21=\"\",$C21=\"\"),\"\",IF(LEFT($D21,1)<RIGHT($D21,1),$A21,$C21)))))","v":"Vrběcký Daniel    (B.  Jablonec n. N.) - U17"},null,"6. místo"]
[{"$f":"IF(AND($D16=\"\",$A16=\"\",$C16=\"\"),\"\",IF(AND($A16=\"\",$C16<>\"\"),$C16,IF(AND($A16<>\"\",$C16=\"\"),$A16,IF(AND($A16=\"\",$C16=\"\"),\"\",IF(LEFT($D16,1)>RIGHT($D16,1),$A16,$C16)))))","v":"Rambousek Jan   (Spartak Chrastava) - U15"},null,"7. místo"]
[{"$f":"IF(AND($D16=\"\",$A16=\"\",$C16=\"\"),\"\",IF(AND($A16=\"\",$C16<>\"\"),$C16,IF(AND($A16<>\"\",$C16=\"\"),$A16,IF(AND($A16=\"\",$C16=\"\"),\"\",IF(LEFT($D16,1)<RIGHT($D16,1),$A16,$C16)))))","v":"Rek Vít    (Loko Česká Lípa) - U13"},null,"8. místo"]
[]
[]
[]
[]
[]
[]
[]
[]
[]
[]
[]
[]
[null,null,null,"."]

{"sheet":"2divize-B","index":13,"n_rows":44,"n_cols":5,"rows_kept":44,"cut":false,"hidden":true,"merged":[[0,1,0,4],[1,1,1,4],[2,1,2,4]]}
["Název souteže:",{"$f":"A_skupiny!A1","v":"10. KBT Libereckého kraje"}]
["Kategorie, den",{"$f":"A_skupiny!A3","v":"Turnov, 14.05.2022"}]
["Kolo","2. divize - o 9. - 16. místo"]
[null,null,null,"výsledek","wo"]
["o 9.-16. místo"]
["Čupcová Viktorie   (Jiskra Nový Bor) - U13",null,"Kobosil Tomáš   (SKST Liberec) - U15","3:0"]
["Košťák Matěj   (B.  Jablonec n. N.) - U15",null,"Krotilová Adéla   (SKST Liberec) - U15","3:0"]
["Bartoň David    (SKST Liberec) - U15",null,"Kuntoš Filip   (SKST Liberec) - U17","3:1"]
["Perlík Josef    (KMST Liberec) - U11",null,"Königová Anežka    (STAR Turnov) - U15","3:2"]
["o 13.-16. místo"]
[{"$f":"IF(AND($D6=\"\",$A6=\"\",$C6=\"\"),\"\",IF(AND($A6=\"\",$C6<>\"\"),$C6,IF(AND($A6<>\"\",$C6=\"\"),$A6,IF($D6=\"\",\"\",IF(LEFT($D6,1)<RIGHT($D6,1),$A6,$C6)))))","v":"Kobosil Tomáš   (SKST Liberec) - U15"},null,{"$f":"IF(AND($D7=\"\",$A7=\"\",$C7=\"\"),\"\",IF(AND($A7=\"\",$C7<>\"\"),$C7,IF(AND($A7<>\"\",$C7=\"\"),$A7,IF($D7=\"\",\"\",IF(LEFT($D7,1)<RIGHT($D7,1),$A7,$C7)))))","v":"Krotilová Adéla   (SKST Liberec) - U15"},"3:1"]
[{"$f":"IF(AND($D8=\"\",$A8=\"\",$C8=\"\"),\"\",IF(AND($A8=\"\",$C8<>\"\"),$C8,IF(AND($A8<>\"\",$C8=\"\"),$A8,IF($D8=\"\",\"\",IF(LEFT($D8,1)<RIGHT($D8,1),$A8,$C8)))))","v":"Kuntoš Filip   (SKST Liberec) - U17"},null,{"$f":"IF(AND($D9=\"\",$A9=\"\",$C9=\"\"),\"\",IF(AND($A9=\"\",$C9<>\"\"),$C9,IF(AND($A9<>\"\",$C9=\"\"),$A9,IF($D9=\"\",\"\",IF(LEFT($D9,1)<RIGHT($D9,1),$A9,$C9)))))","v":"Königová Anežka    (STAR Turnov) - U15"},"3:2"]
["o 11.-12. místo"]
[{"$f":"IF($D18=\"\",\"\",IF(AND($A18=\"\",$C18<>\"\"),C18,IF(AND($A18<>\"\",$C18=\"\"),A18,IF(AND($A18=\"\",$C18=\"\"),\"\",IF(LEFT($D18,1)<RIGHT($D18,1),A18,C18)))))","v":"Košťák Matěj   (B.  Jablonec n. N.) - U15"},null,{"$f":"IF($D19=\"\",\"\",IF(AND($A19=\"\",$C19<>\"\"),$C19,IF(AND($A19<>\"\",$C19=\"\"),$A19,IF(AND($A19=\"\",$C19=\"\"),\"\",IF(LEFT($D19,1)<RIGHT($D19,1),$A19,$C19)))))","v":"Perlík Josef    (KMST Liberec) - U11"},"3:0"]
["o 15.-16. místo"]
[{"$f":"IF(AND($D11=\"\",$A11=\"\",$C11=\"\"),\"\",IF(AND($A11=\"\",$C11<>\"\"),$C11,IF(AND($A11<>\"\",$C11=\"\"),$A11,IF(AND($A11=\"\",$C11=\"\"),\"\",IF(LEFT($D11,1)<RIGHT($D11,1),$A11,$C11)))))","v":"Krotilová Adéla   (SKST Liberec) - U15"},null,{"$f":"IF(AND($D12=\"\",$A12=\"\",$C12=\"\"),\"\",IF(AND($A12=\"\",$C12<>\"\"),$C12,IF(AND($A12<>\"\",$C12=\"\"),$A12,IF(AND($A12=\"\",$C12=\"\"),\"\",IF(LEFT($D12,1)<RIGHT($D12,1),$A12,$C12)))))","v":"Königová Anežka    (STAR Turnov) - U15"},"3:0"]
["o 9.-16. místo - semifinále"]
[{"$f":"IF(AND($D6=\"\",$A6=\"\",$C6=\"\"),\"\",IF(AND($A6=\"\",$C6<>\"\"),$C6,IF(AND($A6<>\"\",$C6=\"\"),$A6,IF($D6=\"\",\"\",IF(LEFT($D6,1)>RIGHT($D6,1),$A6,$C6)))))","v":"Čupcová Viktorie   (Jiskra Nový Bor) - U13"},null,{"$f":"IF(AND($D7=\"\",$A7=\"\",$C7=\"\"),\"\",IF(AND($A7=\"\",$C7<>\"\"),$C7,IF(AND($A7<>\"\",$C7=\"\"),$A7,IF($D7=\"\",\"\",IF(LEFT($D7,1)>RIGHT($D7,1),$A7,$C7)))))","v":"Košťák Matěj   (B.  Jablonec n. N.) - U15"},"3:1"]
[{"$f":"IF(AND($D8=\"\",$A8=\"\",$C8=\"\"),\"\",IF(AND($A8=\"\",$C8<>\"\"),$C8,IF(AND($A8<>\"\",$C8=\"\"),$A8,IF($D8=\"\",\"\",IF(LEFT($D8,1)>RIGHT($D8,1),$A8,$C8)))))","v":"Bartoň David    (SKST Liberec) - U15"},null,{"$f":"IF(AND($D9=\"\",$A9=\"\",$C9=\"\"),\"\",IF(AND($A9=\"\",$C9<>\"\"),$C9,IF(AND($A9<>\"\",$C9=\"\"),$A9,IF($D9=\"\",\"\",IF(LEFT($D9,1)>RIGHT($D9,1),$A9,$C9)))))","v":"Perlík Josef    (KMST Liberec) - U11"},"3:1"]
["13.-14 místo"]
[{"$f":"IF(AND($D11=\"\",$A11=\"\",$C11=\"\"),\"\",IF(AND($A11=\"\",$C11<>\"\"),$C11,IF(AND($A11<>\"\",$C11=\"\"),$A11,IF(AND($A11=\"\",$C11=\"\"),\"\",IF(LEFT($D11,1)>RIGHT($D11,1),$A11,$C11)))))","v":"Kobosil Tomáš   (SKST Liberec) - U15"},null,{"$f":"IF(AND($D12=\"\",$A12=\"\",$C12=\"\"),\"\",IF(AND($A12=\"\",$C12<>\"\"),$C12,IF(AND($A12<>\"\",$C12=\"\"),$A12,IF(AND($A12=\"\",$C12=\"\"),\"\",IF(LEFT($D12,1)>RIGHT($D12,1),$A12,$C12)))))","v":"Kuntoš Filip   (SKST Liberec) - U17"},"0:3"]
["o 9.-10. místo"]
[{"$f":"IF($D18=\"\",\"\",IF(AND($A18=\"\",$C18<>\"\"),C18,IF(AND($A18<>\"\",$C18=\"\"),A18,IF(AND($A18=\"\",$C18=\"\"),\"\",IF(LEFT($D18,1)>RIGHT($D18,1),A18,C18)))))","v":"Čupcová Viktorie   (Jiskra Nový Bor) - U13"},null,{"$f":"IF($D19=\"\",\"\",IF(AND($A19=\"\",$C19<>\"\"),$C19,IF(AND($A19<>\"\",$C19=\"\"),$A19,IF(AND($A19=\"\",$C19=\"\"),\"\",IF(LEFT($D19,1)>RIGHT($D19,1),$A19,$C19)))))","v":"Bartoň David    (SKST Liberec) - U15"},"3:1"]
[{"$f":"IF($D23=\"\",\"\",IF(AND($A23=\"\",$C23<>\"\"),C23,IF(AND($A23<>\"\",$C23=\"\"),A23,IF(AND($A23=\"\",$C23=\"\"),\"\",IF(LEFT($D23,1)>RIGHT($D23,1),A23,C23)))))","v":"Čupcová Viktorie   (Jiskra Nový Bor) - U13"},null,"9. místo"]
[{"$f":"IF($D23=\"\",\"\",IF(AND($A23=\"\",$C23<>\"\"),C23,IF(AND($A23<>\"\",$C23=\"\"),A23,IF(AND($A23=\"\",$C23=\"\"),\"\",IF(LEFT($D23,1)<RIGHT($D23,1),A23,C23)))))","v":"Bartoň David    (SKST Liberec) - U15"},null,"10. místo"]
[{"$f":"IF(AND($D14=\"\",$A14=\"\",$C14=\"\"),\"\",IF(AND($A14=\"\",$C14<>\"\"),$C14,IF(AND($A14<>\"\",$C14=\"\"),$A14,IF(AND($A14=\"\",$C14=\"\"),\"\",IF(LEFT($D14,1)>RIGHT($D14,1),$A14,$C14)))))","v":"Košťák Matěj   (B.  Jablonec n. N.) - U15"},null,"11. místo"]
[{"$f":"IF(AND($D14=\"\",$A14=\"\",$C14=\"\"),\"\",IF(AND($A14=\"\",$C14<>\"\"),$C14,IF(AND($A14<>\"\",$C14=\"\"),$A14,IF(AND($A14=\"\",$C14=\"\"),\"\",IF(LEFT($D14,1)<RIGHT($D14,1),$A14,$C14)))))","v":"Perlík Josef    (KMST Liberec) - U11"},null,"12. místo"]
[{"$f":"IF(AND($D21=\"\",$A21=\"\",$C21=\"\"),\"\",IF(AND($A21=\"\",$C21<>\"\"),$C21,IF(AND($A21<>\"\",$C21=\"\"),$A21,IF(AND($A21=\"\",$C21=\"\"),\"\",IF(LEFT($D21,1)>RIGHT($D21,1),$A21,$C21)))))","v":"Kuntoš Filip   (SKST Liberec) - U17"},null,"13. místo"]
[{"$f":"IF(AND($D21=\"\",$A21=\"\",$C21=\"\"),\"\",IF(AND($A21=\"\",$C21<>\"\"),$C21,IF(AND($A21<>\"\",$C21=\"\"),$A21,IF(AND($A21=\"\",$C21=\"\"),\"\",IF(LEFT($D21,1)<RIGHT($D21,1),$A21,$C21)))))","v":"Kobosil Tomáš   (SKST Liberec) - U15"},null,"14. místo"]
[{"$f":"IF(AND($D16=\"\",$A16=\"\",$C16=\"\"),\"\",IF(AND($A16=\"\",$C16<>\"\"),$C16,IF(AND($A16<>\"\",$C16=\"\"),$A16,IF(AND($A16=\"\",$C16=\"\"),\"\",IF(LEFT($D16,1)>RIGHT($D16,1),$A16,$C16)))))","v":"Krotilová Adéla   (SKST Liberec) - U15"},null,"15. místo"]
[{"$f":"IF(AND($D16=\"\",$A16=\"\",$C16=\"\"),\"\",IF(AND($A16=\"\",$C16<>\"\"),$C16,IF(AND($A16<>\"\",$C16=\"\"),$A16,IF(AND($A16=\"\",$C16=\"\"),\"\",IF(LEFT($D16,1)<RIGHT($D16,1),$A16,$C16)))))","v":"Königová Anežka    (STAR Turnov) - U15"},null,"16. místo"]
[]
[]
[]
[]
[]
[]
[]
[]
[]
[]
[]
[]
[null,null,null,"."]

{"sheet":"3divize-A","index":14,"n_rows":44,"n_cols":5,"rows_kept":44,"cut":false,"hidden":true,"merged":[[0,1,0,4],[1,1,1,4],[2,1,2,4]]}
["Název souteže:",{"$f":"A_skupiny!A1","v":"10. KBT Libereckého kraje"}]
["Kategorie, den",{"$f":"A_skupiny!A3","v":"Turnov, 14.05.2022"}]
["Kolo","3. divize - o 1. - 8. místo"]
[null,null,null,"výsledek","wo"]
["o 1.-8. místo"]
["Stach Vojtěch   (STAR Turnov) - U17",null,"Salaba Marek    (Spartak Smržovka) - U15","3:0"]
["Motlík Denis   (Loko Česká Lípa) - U15",null,"Sehnoutka Matěj    (Spartak Chrastava) - U15","3:1"]
["Opluštil Jan   (STAR Turnov) - U17",null,"Kožich Vítek   (SKST Liberec) - U13","3:0"]
["Korpová Tereza   (AST Kamenický Šenov) - U11",null,"Hůlková Anna    (SKST Liberec) - U17","0:3"]
["o 5.-8. místo"]
[{"$f":"IF(AND($D6=\"\",$A6=\"\",$C6=\"\"),\"\",IF(AND($A6=\"\",$C6<>\"\"),$C6,IF(AND($A6<>\"\",$C6=\"\"),$A6,IF($D6=\"\",\"\",IF(LEFT($D6,1)<RIGHT($D6,1),$A6,$C6)))))","v":"Salaba Marek    (Spartak Smržovka) - U15"},null,{"$f":"IF(AND($D7=\"\",$A7=\"\",$C7=\"\"),\"\",IF(AND($A7=\"\",$C7<>\"\"),$C7,IF(AND($A7<>\"\",$C7=\"\"),$A7,IF($D7=\"\",\"\",IF(LEFT($D7,1)<RIGHT($D7,1),$A7,$C7)))))","v":"Sehnoutka Matěj    (Spartak Chrastava) - U15"},"2:3"]
[{"$f":"IF(AND($D8=\"\",$A8=\"\",$C8=\"\"),\"\",IF(AND($A8=\"\",$C8<>\"\"),$C8,IF(AND($A8<>\"\",$C8=\"\"),$A8,IF($D8=\"\",\"\",IF(LEFT($D8,1)<RIGHT($D8,1),$A8,$C8)))))","v":"Kožich Vítek   (SKST Liberec) - U13"},null,{"$f":"IF(AND($D9=\"\",$A9=\"\",$C9=\"\"),\"\",IF(AND($A9=\"\",$C9<>\"\"),$C9,IF(AND($A9<>\"\",$C9=\"\"),$A9,IF($D9=\"\",\"\",IF(LEFT($D9,1)<RIGHT($D9,1),$A9,$C9)))))","v":"Korpová Tereza   (AST Kamenický Šenov) - U11"},"2:3"]
["o 3. 4. místo"]
[{"$f":"IF($D18=\"\",\"\",IF(AND($A18=\"\",$C18<>\"\"),C18,IF(AND($A18<>\"\",$C18=\"\"),A18,IF(AND($A18=\"\",$C18=\"\"),\"\",IF(LEFT($D18,1)<RIGHT($D18,1),A18,C18)))))","v":"Stach Vojtěch   (STAR Turnov) - U17"},null,{"$f":"IF($D19=\"\",\"\",IF(AND($A19=\"\",$C19<>\"\"),$C19,IF(AND($A19<>\"\",$C19=\"\"),$A19,IF(AND($A19=\"\",$C19=\"\"),\"\",IF(LEFT($D19,1)<RIGHT($D19,1),$A19,$C19)))))","v":"Opluštil Jan   (STAR Turnov) - U17"},"3:1"]
["o 7.-8. místo"]
[{"$f":"IF(AND($D11=\"\",$A11=\"\",$C11=\"\"),\"\",IF(AND($A11=\"\",$C11<>\"\"),$C11,IF(AND($A11<>\"\",$C11=\"\"),$A11,IF(AND($A11=\"\",$C11=\"\"),\"\",IF(LEFT($D11,1)<RIGHT($D11,1),$A11,$C11)))))","v":"Salaba Marek    (Spartak Smržovka) - U15"},null,{"$f":"IF(AND($D12=\"\",$A12=\"\",$C12=\"\"),\"\",IF(AND($A12=\"\",$C12<>\"\"),$C12,IF(AND($A12<>\"\",$C12=\"\"),$A12,IF(AND($A12=\"\",$C12=\"\"),\"\",IF(LEFT($D12,1)<RIGHT($D12,1),$A12,$C12)))))","v":"Kožich Vítek   (SKST Liberec) - U13"},"3:1"]
["o 1.-4. místo"]
[{"$f":"IF(AND($D6=\"\",$A6=\"\",$C6=\"\"),\"\",IF(AND($A6=\"\",$C6<>\"\"),$C6,IF(AND($A6<>\"\",$C6=\"\"),$A6,IF($D6=\"\",\"\",IF(LEFT($D6,1)>RIGHT($D6,1),$A6,$C6)))))","v":"Stach Vojtěch   (STAR Turnov) - U17"},null,{"$f":"IF(AND($D7=\"\",$A7=\"\",$C7=\"\"),\"\",IF(AND($A7=\"\",$C7<>\"\"),$C7,IF(AND($A7<>\"\",$C7=\"\"),$A7,IF($D7=\"\",\"\",IF(LEFT($D7,1)>RIGHT($D7,1),$A7,$C7)))))","v":"Motlík Denis   (Loko Česká Lípa) - U15"},"1:3"]
[{"$f":"IF(AND($D8=\"\",$A8=\"\",$C8=\"\"),\"\",IF(AND($A8=\"\",$C8<>\"\"),$C8,IF(AND($A8<>\"\",$C8=\"\"),$A8,IF($D8=\"\",\"\",IF(LEFT($D8,1)>RIGHT($D8,1),$A8,$C8)))))","v":"Opluštil Jan   (STAR Turnov) - U17"},null,{"$f":"IF(AND($D9=\"\",$A9=\"\",$C9=\"\"),\"\",IF(AND($A9=\"\",$C9<>\"\"),$C9,IF(AND($A9<>\"\",$C9=\"\"),$A9,IF($D9=\"\",\"\",IF(LEFT($D9,1)>RIGHT($D9,1),$A9,$C9)))))","v":"Hůlková Anna    (SKST Liberec) - U17"},"2:3"]
["5.-6. místo"]
[{"$f":"IF(AND($D11=\"\",$A11=\"\",$C11=\"\"),\"\",IF(AND($A11=\"\",$C11<>\"\"),$C11,IF(AND($A11<>\"\",$C11=\"\"),$A11,IF(AND($A11=\"\",$C11=\"\"),\"\",IF(LEFT($D11,1)>RIGHT($D11,1),$A11,$C11)))))","v":"Sehnoutka Matěj    (Spartak Chrastava) - U15"},null,{"$f":"IF(AND($D12=\"\",$A12=\"\",$C12=\"\"),\"\",IF(AND($A12=\"\",$C12<>\"\"),$C12,IF(AND($A12<>\"\",$C12=\"\"),$A12,IF(AND($A12=\"\",$C12=\"\"),\"\",IF(LEFT($D12,1)>RIGHT($D12,1),$A12,$C12)))))","v":"Korpová Tereza   (AST Kamenický Šenov) - U11"},"3:0"]
["o 1.-2. místo"]
[{"$f":"IF($D18=\"\",\"\",IF(AND($A18=\"\",$C18<>\"\"),C18,IF(AND($A18<>\"\",$C18=\"\"),A18,IF(AND($A18=\"\",$C18=\"\"),\"\",IF(LEFT($D18,1)>RIGHT($D18,1),A18,C18)))))","v":"Motlík Denis   (Loko Česká Lípa) - U15"},null,{"$f":"IF($D19=\"\",\"\",IF(AND($A19=\"\",$C19<>\"\"),$C19,IF(AND($A19<>\"\",$C19=\"\"),$A19,IF(AND($A19=\"\",$C19=\"\"),\"\",IF(LEFT($D19,1)>RIGHT($D19,1),$A19,$C19)))))","v":"Hůlková Anna    (SKST Liberec) - U17"},"1:3"]
[{"$f":"IF($D23=\"\",\"\",IF(AND($A23=\"\",$C23<>\"\"),C23,IF(AND($A23<>\"\",$C23=\"\"),A23,IF(AND($A23=\"\",$C23=\"\"),\"\",IF(LEFT($D23,1)>RIGHT($D23,1),A23,C23)))))","v":"Hůlková Anna    (SKST Liberec) - U17"},null,"1. místo"]
[{"$f":"IF($D23=\"\",\"\",IF(AND($A23=\"\",$C23<>\"\"),C23,IF(AND($A23<>\"\",$C23=\"\"),A23,IF(AND($A23=\"\",$C23=\"\"),\"\",IF(LEFT($D23,1)<RIGHT($D23,1),A23,C23)))))","v":"Motlík Denis   (Loko Česká Lípa) - U15"},null,"2. místo"]
[{"$f":"IF(AND($D14=\"\",$A14=\"\",$C14=\"\"),\"\",IF(AND($A14=\"\",$C14<>\"\"),$C14,IF(AND($A14<>\"\",$C14=\"\"),$A14,IF(AND($A14=\"\",$C14=\"\"),\"\",IF(LEFT($D14,1)>RIGHT($D14,1),$A14,$C14)))))","v":"Stach Vojtěch   (STAR Turnov) - U17"},null,"3. místo"]
[{"$f":"IF(AND($D14=\"\",$A14=\"\",$C14=\"\"),\"\",IF(AND($A14=\"\",$C14<>\"\"),$C14,IF(AND($A14<>\"\",$C14=\"\"),$A14,IF(AND($A14=\"\",$C14=\"\"),\"\",IF(LEFT($D14,1)<RIGHT($D14,1),$A14,$C14)))))","v":"Opluštil Jan   (STAR Turnov) - U17"},null,"4. místo"]
[{"$f":"IF(AND($D21=\"\",$A21=\"\",$C21=\"\"),\"\",IF(AND($A21=\"\",$C21<>\"\"),$C21,IF(AND($A21<>\"\",$C21=\"\"),$A21,IF(AND($A21=\"\",$C21=\"\"),\"\",IF(LEFT($D21,1)>RIGHT($D21,1),$A21,$C21)))))","v":"Sehnoutka Matěj    (Spartak Chrastava) - U15"},null,"5. místo"]
[{"$f":"IF(AND($D21=\"\",$A21=\"\",$C21=\"\"),\"\",IF(AND($A21=\"\",$C21<>\"\"),$C21,IF(AND($A21<>\"\",$C21=\"\"),$A21,IF(AND($A21=\"\",$C21=\"\"),\"\",IF(LEFT($D21,1)<RIGHT($D21,1),$A21,$C21)))))","v":"Korpová Tereza   (AST Kamenický Šenov) - U11"},null,"6. místo"]
[{"$f":"IF(AND($D16=\"\",$A16=\"\",$C16=\"\"),\"\",IF(AND($A16=\"\",$C16<>\"\"),$C16,IF(AND($A16<>\"\",$C16=\"\"),$A16,IF(AND($A16=\"\",$C16=\"\"),\"\",IF(LEFT($D16,1)>RIGHT($D16,1),$A16,$C16)))))","v":"Salaba Marek    (Spartak Smržovka) - U15"},null,"7. místo"]
[{"$f":"IF(AND($D16=\"\",$A16=\"\",$C16=\"\"),\"\",IF(AND($A16=\"\",$C16<>\"\"),$C16,IF(AND($A16<>\"\",$C16=\"\"),$A16,IF(AND($A16=\"\",$C16=\"\"),\"\",IF(LEFT($D16,1)<RIGHT($D16,1),$A16,$C16)))))","v":"Kožich Vítek   (SKST Liberec) - U13"},null,"8. místo"]
[]
[]
[]
[]
[]
[]
[]
[]
[]
[]
[]
[]
[null,null,null,"."]

{"sheet":"C_finale","index":15,"n_rows":40,"n_cols":4,"rows_kept":40,"cut":false,"hidden":false,"merged":[[0,1,0,2],[1,1,1,2],[2,1,2,2],[3,1,3,2]]}
["Název soutěže:",{"$f":"A_skupiny!A1","v":"10. KBT Libereckého kraje"}]
[]
["Kategorie, den",{"$f":"A_skupiny!A3","v":"Turnov, 14.05.2022"}]
["Kolo","Divize C finále"]
[]
[{"$f":"'3divize-A'!A5","v":"o 1.-8. místo"}]
["Panáček Filip (Loko Česká Lípa) - U13"]
[null,"Panáček Filip (Loko Česká Lípa) - U13"]
["Vaněk Tomáš (SKST Liberec) - U19",{"$f":"IF('3divize-A'!D6=\"\",\"\",IF(LEFT('3divize-A'!D6,1)>RIGHT('3divize-A'!D6,1),'3divize-A'!D6,RIGHT('3divize-A'!D6,1)&\":\"&LEFT('3divize-A'!D6,1)))","v":"3:0"}]
[null,null,"Panáček Filip (Loko Česká Lípa) - U13"]
["Stejskal Šimon (SKST Liberec) - U13",null,{"$f":"IF('3divize-A'!D18=\"\",\"\",IF(LEFT('3divize-A'!D18,1)>RIGHT('3divize-A'!D18,1),'3divize-A'!D18,RIGHT('3divize-A'!D18,1)&\":\"&LEFT('3divize-A'!D18,1)))","v":"3:1"}]
[null,"Rak Oliver (KMST Liberec) - U11"]
["Rak Oliver (KMST Liberec) - U11","3:0"]
[null,null,null,"Bárta Tomáš (STAR Turnov) - U17"]
["Krejčík Jan (Bižu Jablonec) - U13",null,null,"3:0"]
[null,"Bárta Tomáš (STAR Turnov) - U17"]
["Bárta Tomáš (STAR Turnov) - U17","3:0"]
[null,null,"Bárta Tomáš (STAR Turnov) - U17"]
["Šulc Štěpán (SKST Liberec) - U13",null,"3:1"]
[null,"Stach Vojtěch (STAR Turnov) - U17"]
["Stach Vojtěch (STAR Turnov) - U17",{"$f":"IF('3divize-A'!D9=\"\",\"\",IF(LEFT('3divize-A'!D9,1)>RIGHT('3divize-A'!D9,1),'3divize-A'!D9,RIGHT('3divize-A'!D9,1)&\":\"&LEFT('3divize-A'!D9,1)))","v":"3:0"}]
[]
[{"$f":"'3divize-A'!A10","v":"o 5.-8. místo"}]
["Vaněk Tomáš (SKST Liberec) - U19",null,{"$f":"IF('3divize-A'!D57=\"\",\"\",IF(LEFT('3divize-A'!D57,1)>RIGHT('3divize-A'!D57,1),'3divize-A'!D57,RIGHT('3divize-A'!D57,1)&\":\"&LEFT('3divize-A'!D57,1)))","v":""}]
[null,"Vaněk Tomáš (SKST Liberec) - U19"]
["Stejskal Šimon (SKST Liberec) - U13","3:1"]
[null,null,"Vaněk Tomáš (SKST Liberec) - U19"]
["Krejčík Jan (Bižu Jablonec) - U13",null,{"$f":"IF('3divize-A'!D21=\"\",\"\",IF(LEFT('3divize-A'!D21,1)>RIGHT('3divize-A'!D21,1),'3divize-A'!D21,RIGHT('3divize-A'!D21,1)&\":\"&LEFT('3divize-A'!D21,1)))","v":"3:0"}]
[null,"Krejčík Jan (Bižu Jablonec) - U13"]
["Šulc Štěpán (SKST Liberec) - U13",{"$f":"IF('3divize-A'!D12=\"\",\"\",IF(LEFT('3divize-A'!D12,1)>RIGHT('3divize-A'!D12,1),'3divize-A'!D12,RIGHT('3divize-A'!D12,1)&\":\"&LEFT('3divize-A'!D12,1)))","v":"3:2"}]
[]
[{"$f":"'3divize-A'!A13","v":"o 3. 4. místo"}]
["Rak Oliver (KMST Liberec) - U11"]
[null,{"$f":"'3divize-A'!A26","v":"Stach Vojtěch   (STAR Turnov) - U17"}]
["Stach Vojtěch (STAR Turnov) - U17",{"$f":"IF('3divize-A'!D14=\"\",\"\",IF(LEFT('3divize-A'!D14,1)>RIGHT('3divize-A'!D14,1),'3divize-A'!D14,RIGHT('3divize-A'!D14,1)&\":\"&LEFT('3divize-A'!D14,1)))","v":"3:1"}]
[]
[{"$f":"'3divize-A'!A15","v":"o 7.-8. místo"}]
["Stejskal Šimon (SKST Liberec) - U13"]
[null,"Stejskal Šimon (SKST Liberec) - U13"]
["Šulc Štěpán (SKST Liberec) - U13",{"$f":"IF('3divize-A'!D16=\"\",\"\",IF(LEFT('3divize-A'!D16,1)>RIGHT('3divize-A'!D16,1),'3divize-A'!D16,RIGHT('3divize-A'!D16,1)&\":\"&LEFT('3divize-A'!D16,1)))","v":"3:1"}]

{"sheet":"3divize-B","index":16,"n_rows":44,"n_cols":5,"rows_kept":44,"cut":false,"hidden":true,"merged":[[0,1,0,4],[1,1,1,4],[2,1,2,4]]}
["Název souteže:",{"$f":"A_skupiny!A1","v":"10. KBT Libereckého kraje"}]
["Kategorie, den",{"$f":"A_skupiny!A3","v":"Turnov, 14.05.2022"}]
["Kolo","3. divize - o 9. - 16. místo"]
[null,null,null,"výsledek","wo"]
["o 9.-16. místo"]
["Flégr Samuel   (KMST Liberec) - U17",null,"Kutěj Štěpán   (STAR Turnov) - U15","3:2"]
["Šulc Štěpán   (SKST Liberec) - U13",null,"Táborský Václav   (STAR Turnov) - U13","0:3"]
["Šťastný Jiří   (KMST Liberec) - U13",null,"Čupcová Valerie    (Jiskra Nový Bor) - U11","3:0"]
["Voplakal Vojtech  (SKST Liberec) - U11",null,"Kubíček Tomáš   (STAR Turnov) - U15","0:3"]
["o 13.-16. místo"]
[{"$f":"IF(AND($D6=\"\",$A6=\"\",$C6=\"\"),\"\",IF(AND($A6=\"\",$C6<>\"\"),$C6,IF(AND($A6<>\"\",$C6=\"\"),$A6,IF($D6=\"\",\"\",IF(LEFT($D6,1)<RIGHT($D6,1),$A6,$C6)))))","v":"Kutěj Štěpán   (STAR Turnov) - U15"},null,{"$f":"IF(AND($D7=\"\",$A7=\"\",$C7=\"\"),\"\",IF(AND($A7=\"\",$C7<>\"\"),$C7,IF(AND($A7<>\"\",$C7=\"\"),$A7,IF($D7=\"\",\"\",IF(LEFT($D7,1)<RIGHT($D7,1),$A7,$C7)))))","v":"Šulc Štěpán   (SKST Liberec) - U13"},"0:3"]
[{"$f":"IF(AND($D8=\"\",$A8=\"\",$C8=\"\"),\"\",IF(AND($A8=\"\",$C8<>\"\"),$C8,IF(AND($A8<>\"\",$C8=\"\"),$A8,IF($D8=\"\",\"\",IF(LEFT($D8,1)<RIGHT($D8,1),$A8,$C8)))))","v":"Čupcová Valerie    (Jiskra Nový Bor) - U11"},null,{"$f":"IF(AND($D9=\"\",$A9=\"\",$C9=\"\"),\"\",IF(AND($A9=\"\",$C9<>\"\"),$C9,IF(AND($A9<>\"\",$C9=\"\"),$A9,IF($D9=\"\",\"\",IF(LEFT($D9,1)<RIGHT($D9,1),$A9,$C9)))))","v":"Voplakal Vojtech  (SKST Liberec) - U11"},"1:3"]
["o 11.-12. místo"]
[{"$f":"IF($D18=\"\",\"\",IF(AND($A18=\"\",$C18<>\"\"),C18,IF(AND($A18<>\"\",$C18=\"\"),A18,IF(AND($A18=\"\",$C18=\"\"),\"\",IF(LEFT($D18,1)<RIGHT($D18,1),A18,C18)))))","v":"Táborský Václav   (STAR Turnov) - U13"},null,{"$f":"IF($D19=\"\",\"\",IF(AND($A19=\"\",$C19<>\"\"),$C19,IF(AND($A19<>\"\",$C19=\"\"),$A19,IF(AND($A19=\"\",$C19=\"\"),\"\",IF(LEFT($D19,1)<RIGHT($D19,1),$A19,$C19)))))","v":"Kubíček Tomáš   (STAR Turnov) - U15"},"3:0"]
["o 15.-16. místo"]
[{"$f":"IF(AND($D11=\"\",$A11=\"\",$C11=\"\"),\"\",IF(AND($A11=\"\",$C11<>\"\"),$C11,IF(AND($A11<>\"\",$C11=\"\"),$A11,IF(AND($A11=\"\",$C11=\"\"),\"\",IF(LEFT($D11,1)<RIGHT($D11,1),$A11,$C11)))))","v":"Kutěj Štěpán   (STAR Turnov) - U15"},null,{"$f":"IF(AND($D12=\"\",$A12=\"\",$C12=\"\"),\"\",IF(AND($A12=\"\",$C12<>\"\"),$C12,IF(AND($A12<>\"\",$C12=\"\"),$A12,IF(AND($A12=\"\",$C12=\"\"),\"\",IF(LEFT($D12,1)<RIGHT($D12,1),$A12,$C12)))))","v":"Čupcová Valerie    (Jiskra Nový Bor) - U11"},"0:3"]
["o 9.-12. místo"]
[{"$f":"IF(AND($D6=\"\",$A6=\"\",$C6=\"\"),\"\",IF(AND($A6=\"\",$C6<>\"\"),$C6,IF(AND($A6<>\"\",$C6=\"\"),$A6,IF($D6=\"\",\"\",IF(LEFT($D6,1)>RIGHT($D6,1),$A6,$C6)))))","v":"Flégr Samuel   (KMST Liberec) - U17"},null,{"$f":"IF(AND($D7=\"\",$A7=\"\",$C7=\"\"),\"\",IF(AND($A7=\"\",$C7<>\"\"),$C7,IF(AND($A7<>\"\",$C7=\"\"),$A7,IF($D7=\"\",\"\",IF(LEFT($D7,1)>RIGHT($D7,1),$A7,$C7)))))","v":"Táborský Václav   (STAR Turnov) - U13"},"3:0"]
[{"$f":"IF(AND($D8=\"\",$A8=\"\",$C8=\"\"),\"\",IF(AND($A8=\"\",$C8<>\"\"),$C8,IF(AND($A8<>\"\",$C8=\"\"),$A8,IF($D8=\"\",\"\",IF(LEFT($D8,1)>RIGHT($D8,1),$A8,$C8)))))","v":"Šťastný Jiří   (KMST Liberec) - U13"},null,{"$f":"IF(AND($D9=\"\",$A9=\"\",$C9=\"\"),\"\",IF(AND($A9=\"\",$C9<>\"\"),$C9,IF(AND($A9<>\"\",$C9=\"\"),$A9,IF($D9=\"\",\"\",IF(LEFT($D9,1)>RIGHT($D9,1),$A9,$C9)))))","v":"Kubíček Tomáš   (STAR Turnov) - U15"},"3:1"]
["o 13.-14. místo"]
[{"$f":"IF(AND($D11=\"\",$A11=\"\",$C11=\"\"),\"\",IF(AND($A11=\"\",$C11<>\"\"),$C11,IF(AND($A11<>\"\",$C11=\"\"),$A11,IF(AND($A11=\"\",$C11=\"\"),\"\",IF(LEFT($D11,1)>RIGHT($D11,1),$A11,$C11)))))","v":"Šulc Štěpán   (SKST Liberec) - U13"},null,{"$f":"IF(AND($D12=\"\",$A12=\"\",$C12=\"\"),\"\",IF(AND($A12=\"\",$C12<>\"\"),$C12,IF(AND($A12<>\"\",$C12=\"\"),$A12,IF(AND($A12=\"\",$C12=\"\"),\"\",IF(LEFT($D12,1)>RIGHT($D12,1),$A12,$C12)))))","v":"Voplakal Vojtech  (SKST Liberec) - U11"},"1:3"]
["o 9.-10. místo"]
[{"$f":"IF($D18=\"\",\"\",IF(AND($A18=\"\",$C18<>\"\"),C18,IF(AND($A18<>\"\",$C18=\"\"),A18,IF(AND($A18=\"\",$C18=\"\"),\"\",IF(LEFT($D18,1)>RIGHT($D18,1),A18,C18)))))","v":"Flégr Samuel   (KMST Liberec) - U17"},null,{"$f":"IF($D19=\"\",\"\",IF(AND($A19=\"\",$C19<>\"\"),$C19,IF(AND($A19<>\"\",$C19=\"\"),$A19,IF(AND($A19=\"\",$C19=\"\"),\"\",IF(LEFT($D19,1)>RIGHT($D19,1),$A19,$C19)))))","v":"Šťastný Jiří   (KMST Liberec) - U13"},"1:3"]
[{"$f":"IF($D23=\"\",\"\",IF(AND($A23=\"\",$C23<>\"\"),C23,IF(AND($A23<>\"\",$C23=\"\"),A23,IF(AND($A23=\"\",$C23=\"\"),\"\",IF(LEFT($D23,1)>RIGHT($D23,1),A23,C23)))))","v":"Šťastný Jiří   (KMST Liberec) - U13"},null,"9. místo"]
[{"$f":"IF($D23=\"\",\"\",IF(AND($A23=\"\",$C23<>\"\"),C23,IF(AND($A23<>\"\",$C23=\"\"),A23,IF(AND($A23=\"\",$C23=\"\"),\"\",IF(LEFT($D23,1)<RIGHT($D23,1),A23,C23)))))","v":"Flégr Samuel   (KMST Liberec) - U17"},null,"10. místo"]
[{"$f":"IF(AND($D14=\"\",$A14=\"\",$C14=\"\"),\"\",IF(AND($A14=\"\",$C14<>\"\"),$C14,IF(AND($A14<>\"\",$C14=\"\"),$A14,IF(AND($A14=\"\",$C14=\"\"),\"\",IF(LEFT($D14,1)>RIGHT($D14,1),$A14,$C14)))))","v":"Táborský Václav   (STAR Turnov) - U13"},null,"11. místo"]
[{"$f":"IF(AND($D14=\"\",$A14=\"\",$C14=\"\"),\"\",IF(AND($A14=\"\",$C14<>\"\"),$C14,IF(AND($A14<>\"\",$C14=\"\"),$A14,IF(AND($A14=\"\",$C14=\"\"),\"\",IF(LEFT($D14,1)<RIGHT($D14,1),$A14,$C14)))))","v":"Kubíček Tomáš   (STAR Turnov) - U15"},null,"12. místo"]
[{"$f":"IF(AND($D21=\"\",$A21=\"\",$C21=\"\"),\"\",IF(AND($A21=\"\",$C21<>\"\"),$C21,IF(AND($A21<>\"\",$C21=\"\"),$A21,IF(AND($A21=\"\",$C21=\"\"),\"\",IF(LEFT($D21,1)>RIGHT($D21,1),$A21,$C21)))))","v":"Voplakal Vojtech  (SKST Liberec) - U11"},null,"13. místo"]
[{"$f":"IF(AND($D21=\"\",$A21=\"\",$C21=\"\"),\"\",IF(AND($A21=\"\",$C21<>\"\"),$C21,IF(AND($A21<>\"\",$C21=\"\"),$A21,IF(AND($A21=\"\",$C21=\"\"),\"\",IF(LEFT($D21,1)<RIGHT($D21,1),$A21,$C21)))))","v":"Šulc Štěpán   (SKST Liberec) - U13"},null,"14. místo"]
[{"$f":"IF(AND($D16=\"\",$A16=\"\",$C16=\"\"),\"\",IF(AND($A16=\"\",$C16<>\"\"),$C16,IF(AND($A16<>\"\",$C16=\"\"),$A16,IF(AND($A16=\"\",$C16=\"\"),\"\",IF(LEFT($D16,1)>RIGHT($D16,1),$A16,$C16)))))","v":"Čupcová Valerie    (Jiskra Nový Bor) - U11"},null,"15. místo"]
[{"$f":"IF(AND($D16=\"\",$A16=\"\",$C16=\"\"),\"\",IF(AND($A16=\"\",$C16<>\"\"),$C16,IF(AND($A16<>\"\",$C16=\"\"),$A16,IF(AND($A16=\"\",$C16=\"\"),\"\",IF(LEFT($D16,1)<RIGHT($D16,1),$A16,$C16)))))","v":"Kutěj Štěpán   (STAR Turnov) - U15"},null,"16. místo"]
[]
[]
[]
[]
[]
[]
[]
[]
[]
[]
[]
[]
[null,null,null,"."]

{"sheet":"C_utecha","index":17,"n_rows":40,"n_cols":4,"rows_kept":40,"cut":false,"hidden":false,"merged":[[0,1,0,2],[1,1,1,2],[2,1,2,2],[3,1,3,2]]}
["Název soutěže:",{"$f":"A_skupiny!A1","v":"10. KBT Libereckého kraje"}]
[]
["Kategorie, den",{"$f":"A_skupiny!A3","v":"Turnov, 14.05.2022"}]
["Kolo","Divize C_útěcha"]
[]
[{"$f":"'3divize-B'!A5","v":"o 9.-16. místo"}]
["Cyprián Ondřej (KMST Liberec) - U13"]
[null,"Klinger Petr (Spartak Chrastava) - U13"]
["Klinger Petr (Spartak Chrastava) - U13",{"$f":"IF('3divize-B'!D6=\"\",\"\",IF(LEFT('3divize-B'!D6,1)>RIGHT('3divize-B'!D6,1),'3divize-B'!D6,RIGHT('3divize-B'!D6,1)&\":\"&LEFT('3divize-B'!D6,1)))","v":"3:2"}]
[null,null,"Valášek Šimon (KMST Liberec) - U11"]
["Hanoušek Adam (STAR Turnov) - U13",null,"3:1"]
[null,"Valášek Šimon (KMST Liberec) - U11"]
["Valášek Šimon (KMST Liberec) - U11",{"$f":"IF('3divize-B'!D7=\"\",\"\",IF(LEFT('3divize-B'!D7,1)>RIGHT('3divize-B'!D7,1),'3divize-B'!D7,RIGHT('3divize-B'!D7,1)&\":\"&LEFT('3divize-B'!D7,1)))","v":"3:0"}]
[null,null,null,"Nohejl Vojtěch (ST Frýdlant) - U13"]
["Klingr Pavel (Spartak Chrastava) - U15",null,null,{"$f":"IF('3divize-B'!D23=\"\",\"\",IF(LEFT('3divize-B'!D23,1)>RIGHT('3divize-B'!D23,1),'3divize-B'!D23,RIGHT('3divize-B'!D23,1)&\":\"&LEFT('3divize-B'!D23,1)))","v":"3:1"}]
[null,"Klingr Pavel (Spartak Chrastava) - U15"]
["Motl Matyáš (KMST Liberec) - U13",{"$f":"IF('3divize-B'!D8=\"\",\"\",IF(LEFT('3divize-B'!D8,1)>RIGHT('3divize-B'!D8,1),'3divize-B'!D8,RIGHT('3divize-B'!D8,1)&\":\"&LEFT('3divize-B'!D8,1)))","v":"3:0"}]
[null,null,"Nohejl Vojtěch (ST Frýdlant) - U13"]
["Nohejl Vojtěch (ST Frýdlant) - U13",null,"3:2"]
[null,"Nohejl Vojtěch (ST Frýdlant) - U13"]
["Porš Zdeněk (SKST Liberec) - U17",{"$f":"IF('3divize-B'!D9=\"\",\"\",IF(LEFT('3divize-B'!D9,1)>RIGHT('3divize-B'!D9,1),'3divize-B'!D9,RIGHT('3divize-B'!D9,1)&\":\"&LEFT('3divize-B'!D9,1)))","v":"3:0"}]
[]
[{"$f":"'3divize-B'!A10","v":"o 13.-16. místo"}]
["Cyprián Ondřej (KMST Liberec) - U13",null,{"$f":"IF('3divize-B'!D57=\"\",\"\",IF(LEFT('3divize-B'!D57,1)>RIGHT('3divize-B'!D57,1),'3divize-B'!D57,RIGHT('3divize-B'!D57,1)&\":\"&LEFT('3divize-B'!D57,1)))","v":""}]
[null,"Hanoušek Adam (STAR Turnov) - U13"]
["Hanoušek Adam (STAR Turnov) - U13","3:1"]
[null,null,"Porš Zdeněk (SKST Liberec) - U17"]
["Motl Matyáš (KMST Liberec) - U13",null,"3:0"]
[null,"Porš Zdeněk (SKST Liberec) - U17"]
["Porš Zdeněk (SKST Liberec) - U17","3:0"]
[]
[{"$f":"'3divize-B'!A13","v":"o 11.-12. místo"}]
["Klinger Petr (Spartak Chrastava) - U13"]
[null,"Klinger Petr (Spartak Chrastava) - U13"]
["Klingr Pavel (Spartak Chrastava) - U15",{"$f":"IF('3divize-B'!D14=\"\",\"\",IF(LEFT('3divize-B'!D14,1)>RIGHT('3divize-B'!D14,1),'3divize-B'!D14,RIGHT('3divize-B'!D14,1)&\":\"&LEFT('3divize-B'!D14,1)))","v":"3:0"}]
[]
[{"$f":"'3divize-B'!A15","v":"o 15.-16. místo"}]
["Cyprián Ondřej (KMST Liberec) - U13"]
[null,"Cyprián Ondřej (KMST Liberec) - U13"]
["Motl Matyáš (KMST Liberec) - U13","3:2"]

{"sheet":"4divize-A","index":18,"n_rows":44,"n_cols":5,"rows_kept":44,"cut":false,"hidden":true,"merged":[[0,1,0,4],[1,1,1,4],[2,1,2,4]]}
["Název souteže:",{"$f":"A_skupiny!A1","v":"10. KBT Libereckého kraje"}]
["Kategorie, den",{"$f":"A_skupiny!A3","v":"Turnov, 14.05.2022"}]
["Kolo","4. divize - o 1. - 8. místo"]
[null,null,null,"výsledek","wo"]
["o 1.-8. místo"]
["Beneš Lukáš    (Spartak Chrastava) - ",null,"Adamíra Šimon  (Sokol Tatobity) - U15","0:3"]
["Augustin Filip  (Sokol STAR Turnov) - U19",null,"Bartoň David  (SKST Liberec) - U15","1:3"]
["Benešová  (Spartak Chrastava) - ",null,"Berka Jan  (Bižuterie Jablonec n. N.) - U15","2:3"]
["Bitman Matěj  (KMST Liberec) - U15",null,"Brelka Zdeněk  (Viktoria Dětřichov) - U15","0:3"]
["o 5.-8. místo"]
[{"$f":"IF(AND($D6=\"\",$A6=\"\",$C6=\"\"),\"\",IF(AND($A6=\"\",$C6<>\"\"),$C6,IF(AND($A6<>\"\",$C6=\"\"),$A6,IF($D6=\"\",\"\",IF(LEFT($D6,1)<RIGHT($D6,1),$A6,$C6)))))","v":"Beneš Lukáš    (Spartak Chrastava) - "},null,{"$f":"IF(AND($D7=\"\",$A7=\"\",$C7=\"\"),\"\",IF(AND($A7=\"\",$C7<>\"\"),$C7,IF(AND($A7<>\"\",$C7=\"\"),$A7,IF($D7=\"\",\"\",IF(LEFT($D7,1)<RIGHT($D7,1),$A7,$C7)))))","v":"Augustin Filip  (Sokol STAR Turnov) - U19"},"3:0"]
[{"$f":"IF(AND($D8=\"\",$A8=\"\",$C8=\"\"),\"\",IF(AND($A8=\"\",$C8<>\"\"),$C8,IF(AND($A8<>\"\",$C8=\"\"),$A8,IF($D8=\"\",\"\",IF(LEFT($D8,1)<RIGHT($D8,1),$A8,$C8)))))","v":"Benešová  (Spartak Chrastava) - "},null,{"$f":"IF(AND($D9=\"\",$A9=\"\",$C9=\"\"),\"\",IF(AND($A9=\"\",$C9<>\"\"),$C9,IF(AND($A9<>\"\",$C9=\"\"),$A9,IF($D9=\"\",\"\",IF(LEFT($D9,1)<RIGHT($D9,1),$A9,$C9)))))","v":"Bitman Matěj  (KMST Liberec) - U15"},"3:0"]
["o 3. 4. místo"]
[{"$f":"IF($D18=\"\",\"\",IF(AND($A18=\"\",$C18<>\"\"),C18,IF(AND($A18<>\"\",$C18=\"\"),A18,IF(AND($A18=\"\",$C18=\"\"),\"\",IF(LEFT($D18,1)<RIGHT($D18,1),A18,C18)))))","v":"Bartoň David  (SKST Liberec) - U15"},null,{"$f":"IF($D19=\"\",\"\",IF(AND($A19=\"\",$C19<>\"\"),$C19,IF(AND($A19<>\"\",$C19=\"\"),$A19,IF(AND($A19=\"\",$C19=\"\"),\"\",IF(LEFT($D19,1)<RIGHT($D19,1),$A19,$C19)))))","v":"Brelka Zdeněk  (Viktoria Dětřichov) - U15"},"0:3"]
["o 7.-8. místo"]
[{"$f":"IF(AND($D11=\"\",$A11=\"\",$C11=\"\"),\"\",IF(AND($A11=\"\",$C11<>\"\"),$C11,IF(AND($A11<>\"\",$C11=\"\"),$A11,IF(AND($A11=\"\",$C11=\"\"),\"\",IF(LEFT($D11,1)<RIGHT($D11,1),$A11,$C11)))))","v":"Augustin Filip  (Sokol STAR Turnov) - U19"},null,{"$f":"IF(AND($D12=\"\",$A12=\"\",$C12=\"\"),\"\",IF(AND($A12=\"\",$C12<>\"\"),$C12,IF(AND($A12<>\"\",$C12=\"\"),$A12,IF(AND($A12=\"\",$C12=\"\"),\"\",IF(LEFT($D12,1)<RIGHT($D12,1),$A12,$C12)))))","v":"Bitman Matěj  (KMST Liberec) - U15"},"1:3"]
["o 1.-4. místo"]
[{"$f":"IF(AND($D6=\"\",$A6=\"\",$C6=\"\"),\"\",IF(AND($A6=\"\",$C6<>\"\"),$C6,IF(AND($A6<>\"\",$C6=\"\"),$A6,IF($D6=\"\",\"\",IF(LEFT($D6,1)>RIGHT($D6,1),$A6,$C6)))))","v":"Adamíra Šimon  (Sokol Tatobity) - U15"},null,{"$f":"IF(AND($D7=\"\",$A7=\"\",$C7=\"\"),\"\",IF(AND($A7=\"\",$C7<>\"\"),$C7,IF(AND($A7<>\"\",$C7=\"\"),$A7,IF($D7=\"\",\"\",IF(LEFT($D7,1)>RIGHT($D7,1),$A7,$C7)))))","v":"Bartoň David  (SKST Liberec) - U15"},"3:0"]
[{"$f":"IF(AND($D8=\"\",$A8=\"\",$C8=\"\"),\"\",IF(AND($A8=\"\",$C8<>\"\"),$C8,IF(AND($A8<>\"\",$C8=\"\"),$A8,IF($D8=\"\",\"\",IF(LEFT($D8,1)>RIGHT($D8,1),$A8,$C8)))))","v":"Berka Jan  (Bižuterie Jablonec n. N.) - U15"},null,{"$f":"IF(AND($D9=\"\",$A9=\"\",$C9=\"\"),\"\",IF(AND($A9=\"\",$C9<>\"\"),$C9,IF(AND($A9<>\"\",$C9=\"\"),$A9,IF($D9=\"\",\"\",IF(LEFT($D9,1)>RIGHT($D9,1),$A9,$C9)))))","v":"Brelka Zdeněk  (Viktoria Dětřichov) - U15"},"3:0"]
["5.-6. místo"]
[{"$f":"IF(AND($D11=\"\",$A11=\"\",$C11=\"\"),\"\",IF(AND($A11=\"\",$C11<>\"\"),$C11,IF(AND($A11<>\"\",$C11=\"\"),$A11,IF(AND($A11=\"\",$C11=\"\"),\"\",IF(LEFT($D11,1)>RIGHT($D11,1),$A11,$C11)))))","v":"Beneš Lukáš    (Spartak Chrastava) - "},null,{"$f":"IF(AND($D12=\"\",$A12=\"\",$C12=\"\"),\"\",IF(AND($A12=\"\",$C12<>\"\"),$C12,IF(AND($A12<>\"\",$C12=\"\"),$A12,IF(AND($A12=\"\",$C12=\"\"),\"\",IF(LEFT($D12,1)>RIGHT($D12,1),$A12,$C12)))))","v":"Benešová  (Spartak Chrastava) - "},"3:0"]
["o 1.-2. místo"]
[{"$f":"IF($D18=\"\",\"\",IF(AND($A18=\"\",$C18<>\"\"),C18,IF(AND($A18<>\"\",$C18=\"\"),A18,IF(AND($A18=\"\",$C18=\"\"),\"\",IF(LEFT($D18,1)>RIGHT($D18,1),A18,C18)))))","v":"Adamíra Šimon  (Sokol Tatobity) - U15"},null,{"$f":"IF($D19=\"\",\"\",IF(AND($A19=\"\",$C19<>\"\"),$C19,IF(AND($A19<>\"\",$C19=\"\"),$A19,IF(AND($A19=\"\",$C19=\"\"),\"\",IF(LEFT($D19,1)>RIGHT($D19,1),$A19,$C19)))))","v":"Berka Jan  (Bižuterie Jablonec n. N.) - U15"},"1:3"]
[{"$f":"IF($D23=\"\",\"\",IF(AND($A23=\"\",$C23<>\"\"),C23,IF(AND($A23<>\"\",$C23=\"\"),A23,IF(AND($A23=\"\",$C23=\"\"),\"\",IF(LEFT($D23,1)>RIGHT($D23,1),A23,C23)))))","v":"Berka Jan  (Bižuterie Jablonec n. N.) - U15"},null,"1. místo"]
[{"$f":"IF($D23=\"\",\"\",IF(AND($A23=\"\",$C23<>\"\"),C23,IF(AND($A23<>\"\",$C23=\"\"),A23,IF(AND($A23=\"\",$C23=\"\"),\"\",IF(LEFT($D23,1)<RIGHT($D23,1),A23,C23)))))","v":"Adamíra Šimon  (Sokol Tatobity) - U15"},null,"2. místo"]
[{"$f":"IF(AND($D14=\"\",$A14=\"\",$C14=\"\"),\"\",IF(AND($A14=\"\",$C14<>\"\"),$C14,IF(AND($A14<>\"\",$C14=\"\"),$A14,IF(AND($A14=\"\",$C14=\"\"),\"\",IF(LEFT($D14,1)>RIGHT($D14,1),$A14,$C14)))))","v":"Brelka Zdeněk  (Viktoria Dětřichov) - U15"},null,"3. místo"]
[{"$f":"IF(AND($D14=\"\",$A14=\"\",$C14=\"\"),\"\",IF(AND($A14=\"\",$C14<>\"\"),$C14,IF(AND($A14<>\"\",$C14=\"\"),$A14,IF(AND($A14=\"\",$C14=\"\"),\"\",IF(LEFT($D14,1)<RIGHT($D14,1),$A14,$C14)))))","v":"Bartoň David  (SKST Liberec) - U15"},null,"4. místo"]
[{"$f":"IF(AND($D21=\"\",$A21=\"\",$C21=\"\"),\"\",IF(AND($A21=\"\",$C21<>\"\"),$C21,IF(AND($A21<>\"\",$C21=\"\"),$A21,IF(AND($A21=\"\",$C21=\"\"),\"\",IF(LEFT($D21,1)>RIGHT($D21,1),$A21,$C21)))))","v":"Beneš Lukáš    (Spartak Chrastava) - "},null,"5. místo"]
[{"$f":"IF(AND($D21=\"\",$A21=\"\",$C21=\"\"),\"\",IF(AND($A21=\"\",$C21<>\"\"),$C21,IF(AND($A21<>\"\",$C21=\"\"),$A21,IF(AND($A21=\"\",$C21=\"\"),\"\",IF(LEFT($D21,1)<RIGHT($D21,1),$A21,$C21)))))","v":"Benešová  (Spartak Chrastava) - "},null,"6. místo"]
[{"$f":"IF(AND($D16=\"\",$A16=\"\",$C16=\"\"),\"\",IF(AND($A16=\"\",$C16<>\"\"),$C16,IF(AND($A16<>\"\",$C16=\"\"),$A16,IF(AND($A16=\"\",$C16=\"\"),\"\",IF(LEFT($D16,1)>RIGHT($D16,1),$A16,$C16)))))","v":"Bitman Matěj  (KMST Liberec) - U15"},null,"7. místo"]
[{"$f":"IF(AND($D16=\"\",$A16=\"\",$C16=\"\"),\"\",IF(AND($A16=\"\",$C16<>\"\"),$C16,IF(AND($A16<>\"\",$C16=\"\"),$A16,IF(AND($A16=\"\",$C16=\"\"),\"\",IF(LEFT($D16,1)<RIGHT($D16,1),$A16,$C16)))))","v":"Augustin Filip  (Sokol STAR Turnov) - U19"},null,"8. místo"]
[]
[]
[]
[]
[]
[]
[]
[]
[]
[]
[]
[]
[null,null,null,"."]

{"sheet":"4divize-A_2","index":19,"n_rows":40,"n_cols":4,"rows_kept":40,"cut":false,"hidden":true,"merged":[[0,1,0,2],[1,1,1,2],[2,1,2,2],[3,1,3,2]]}
["Název soutěže:",{"$f":"A_skupiny!A1","v":"10. KBT Libereckého kraje"}]
[]
["Kategorie, den",{"$f":"A_skupiny!A3","v":"Turnov, 14.05.2022"}]
["Kolo",{"$f":"'4divize-A'!B3:E3","v":"4. divize - o 1. - 8. místo"}]
[]
[{"$f":"'4divize-A'!A5","v":"o 1.-8. místo"}]
[{"$f":"IF('4divize-A'!A6=\"\",\"\",'4divize-A'!A6)","v":"Beneš Lukáš    (Spartak Chrastava) - "}]
[null,{"$f":"'4divize-A'!A18","v":"Adamíra Šimon  (Sokol Tatobity) - U15"}]
[{"$f":"IF('4divize-A'!C6=\"\",\"\",'4divize-A'!C6)","v":"Adamíra Šimon  (Sokol Tatobity) - U15"},{"$f":"IF('4divize-A'!D6=\"\",\"\",IF(LEFT('4divize-A'!D6,1)>RIGHT('4divize-A'!D6,1),'4divize-A'!D6,RIGHT('4divize-A'!D6,1)&\":\"&LEFT('4divize-A'!D6,1)))","v":"3:0"}]
[null,null,{"$f":"'4divize-A'!A23","v":"Adamíra Šimon  (Sokol Tatobity) - U15"}]
[{"$f":"IF('4divize-A'!A7=\"\",\"\",'4divize-A'!A7)","v":"Augustin Filip  (Sokol STAR Turnov) - U19"},null,{"$f":"IF('4divize-A'!D18=\"\",\"\",IF(LEFT('4divize-A'!D18,1)>RIGHT('4divize-A'!D18,1),'4divize-A'!D18,RIGHT('4divize-A'!D18,1)&\":\"&LEFT('4divize-A'!D18,1)))","v":"3:0"}]
[null,{"$f":"'4divize-A'!C18","v":"Bartoň David  (SKST Liberec) - U15"}]
[{"$f":"IF('4divize-A'!C7=\"\",\"\",'4divize-A'!C7)","v":"Bartoň David  (SKST Liberec) - U15"},{"$f":"IF('4divize-A'!D7=\"\",\"\",IF(LEFT('4divize-A'!D7,1)>RIGHT('4divize-A'!D7,1),'4divize-A'!D7,RIGHT('4divize-A'!D7,1)&\":\"&LEFT('4divize-A'!D7,1)))","v":"3:1"}]
[null,null,null,{"$f":"'4divize-A'!A24","v":"Berka Jan  (Bižuterie Jablonec n. N.) - U15"}]
[{"$f":"IF('4divize-A'!A8=\"\",\"\",'4divize-A'!A8)","v":"Benešová  (Spartak Chrastava) - "},null,null,{"$f":"IF('4divize-A'!D23=\"\",\"\",IF(LEFT('4divize-A'!D23,1)>RIGHT('4divize-A'!D23,1),'4divize-A'!D23,RIGHT('4divize-A'!D23,1)&\":\"&LEFT('4divize-A'!D23,1)))","v":"3:1"}]
[null,{"$f":"'4divize-A'!A19","v":"Berka Jan  (Bižuterie Jablonec n. N.) - U15"}]
[{"$f":"IF('4divize-A'!C8=\"\",\"\",'4divize-A'!C8)","v":"Berka Jan  (Bižuterie Jablonec n. N.) - U15"},{"$f":"IF('4divize-A'!D8=\"\",\"\",IF(LEFT('4divize-A'!D8,1)>RIGHT('4divize-A'!D8,1),'4divize-A'!D8,RIGHT('4divize-A'!D8,1)&\":\"&LEFT('4divize-A'!D8,1)))","v":"3:2"}]
[null,null,{"$f":"'4divize-A'!C23","v":"Berka Jan  (Bižuterie Jablonec n. N.) - U15"}]
[{"$f":"IF('4divize-A'!A9=\"\",\"\",'4divize-A'!A9)","v":"Bitman Matěj  (KMST Liberec) - U15"},null,{"$f":"IF('4divize-A'!D19=\"\",\"\",IF(LEFT('4divize-A'!D19,1)>RIGHT('4divize-A'!D19,1),'4divize-A'!D19,RIGHT('4divize-A'!D19,1)&\":\"&LEFT('4divize-A'!D19,1)))","v":"3:0"}]
[null,{"$f":"'4divize-A'!C19","v":"Brelka Zdeněk  (Viktoria Dětřichov) - U15"}]
[{"$f":"IF('4divize-A'!C9=\"\",\"\",'4divize-A'!C9)","v":"Brelka Zdeněk  (Viktoria Dětřichov) - U15"},{"$f":"IF('4divize-A'!D9=\"\",\"\",IF(LEFT('4divize-A'!D9,1)>RIGHT('4divize-A'!D9,1),'4divize-A'!D9,RIGHT('4divize-A'!D9,1)&\":\"&LEFT('4divize-A'!D9,1)))","v":"3:0"}]
[]
[{"$f":"'4divize-A'!A10","v":"o 5.-8. místo"}]
[{"$f":"IF('4divize-A'!A11=\"\",\"\",'4divize-A'!A11)","v":"Beneš Lukáš    (Spartak Chrastava) - "},null,{"$f":"IF('4divize-A'!D57=\"\",\"\",IF(LEFT('4divize-A'!D57,1)>RIGHT('4divize-A'!D57,1),'4divize-A'!D57,RIGHT('4divize-A'!D57,1)&\":\"&LEFT('4divize-A'!D57,1)))","v":""}]
[null,{"$f":"'4divize-A'!A21","v":"Beneš Lukáš    (Spartak Chrastava) - "}]
[{"$f":"IF('4divize-A'!C11=\"\",\"\",'4divize-A'!C11)","v":"Augustin Filip  (Sokol STAR Turnov) - U19"},{"$f":"IF('4divize-A'!D11=\"\",\"\",IF(LEFT('4divize-A'!D11,1)>RIGHT('4divize-A'!D11,1),'4divize-A'!D11,RIGHT('4divize-A'!D11,1)&\":\"&LEFT('4divize-A'!D11,1)))","v":"3:0"}]
[null,null,{"$f":"'4divize-A'!A28","v":"Beneš Lukáš    (Spartak Chrastava) - "}]
[{"$f":"IF('4divize-A'!A12=\"\",\"\",'4divize-A'!A12)","v":"Benešová  (Spartak Chrastava) - "},null,{"$f":"IF('4divize-A'!D21=\"\",\"\",IF(LEFT('4divize-A'!D21,1)>RIGHT('4divize-A'!D21,1),'4divize-A'!D21,RIGHT('4divize-A'!D21,1)&\":\"&LEFT('4divize-A'!D21,1)))","v":"3:0"}]
[null,{"$f":"'4divize-A'!C21","v":"Benešová  (Spartak Chrastava) - "}]
[{"$f":"IF('4divize-A'!C12=\"\",\"\",'4divize-A'!C12)","v":"Bitman Matěj  (KMST Liberec) - U15"},{"$f":"IF('4divize-A'!D12=\"\",\"\",IF(LEFT('4divize-A'!D12,1)>RIGHT('4divize-A'!D12,1),'4divize-A'!D12,RIGHT('4divize-A'!D12,1)&\":\"&LEFT('4divize-A'!D12,1)))","v":"3:0"}]
[]
[{"$f":"'4divize-A'!A13","v":"o 3. 4. místo"}]
[{"$f":"IF('4divize-A'!A14=\"\",\"\",'4divize-A'!A14)","v":"Bartoň David  (SKST Liberec) - U15"}]
[null,{"$f":"'4divize-A'!A26","v":"Brelka Zdeněk  (Viktoria Dětřichov) - U15"}]
[{"$f":"IF('4divize-A'!C14=\"\",\"\",'4divize-A'!C14)","v":"Brelka Zdeněk  (Viktoria Dětřichov) - U15"},{"$f":"IF('4divize-A'!D14=\"\",\"\",IF(LEFT('4divize-A'!D14,1)>RIGHT('4divize-A'!D14,1),'4divize-A'!D14,RIGHT('4divize-A'!D14,1)&\":\"&LEFT('4divize-A'!D14,1)))","v":"3:0"}]
[]
[{"$f":"'4divize-A'!A15","v":"o 7.-8. místo"}]
[{"$f":"IF('4divize-A'!A16=\"\",\"\",'4divize-A'!A16)","v":"Augustin Filip  (Sokol STAR Turnov) - U19"}]
[null,{"$f":"'4divize-A'!A30","v":"Bitman Matěj  (KMST Liberec) - U15"}]
[{"$f":"IF('4divize-A'!C16=\"\",\"\",'4divize-A'!C16)","v":"Bitman Matěj  (KMST Liberec) - U15"},{"$f":"IF('4divize-A'!D16=\"\",\"\",IF(LEFT('4divize-A'!D16,1)>RIGHT('4divize-A'!D16,1),'4divize-A'!D16,RIGHT('4divize-A'!D16,1)&\":\"&LEFT('4divize-A'!D16,1)))","v":"3:1"}]

{"sheet":"5divize-A","index":20,"n_rows":44,"n_cols":5,"rows_kept":44,"cut":false,"hidden":true,"merged":[[0,1,0,4],[1,1,1,4],[2,1,2,4]]}
["Název souteže:",{"$f":"A_skupiny!A1","v":"10. KBT Libereckého kraje"}]
["Kategorie, den",{"$f":"A_skupiny!A3","v":"Turnov, 14.05.2022"}]
["Kolo","5. divize - o 1. - 8. místo"]
[null,null,null,"výsledek","wo"]
["o 1.-8. místo"]
["Beneš Lukáš    (Spartak Chrastava) - ",null,"Adamíra Šimon  (Sokol Tatobity) - U15","0:3"]
["Augustin Filip  (Sokol STAR Turnov) - U19",null,"Bartoň David  (SKST Liberec) - U15","1:3"]
["Benešová  (Spartak Chrastava) - ",null,"Berka Jan  (Bižuterie Jablonec n. N.) - U15","2:3"]
["Bitman Matěj  (KMST Liberec) - U15",null,"Brelka Zdeněk  (Viktoria Dětřichov) - U15","0:3"]
["o 5.-8. místo"]
[{"$f":"IF(AND($D6=\"\",$A6=\"\",$C6=\"\"),\"\",IF(AND($A6=\"\",$C6<>\"\"),$C6,IF(AND($A6<>\"\",$C6=\"\"),$A6,IF($D6=\"\",\"\",IF(LEFT($D6,1)<RIGHT($D6,1),$A6,$C6)))))","v":"Beneš Lukáš    (Spartak Chrastava) - "},null,{"$f":"IF(AND($D7=\"\",$A7=\"\",$C7=\"\"),\"\",IF(AND($A7=\"\",$C7<>\"\"),$C7,IF(AND($A7<>\"\",$C7=\"\"),$A7,IF($D7=\"\",\"\",IF(LEFT($D7,1)<RIGHT($D7,1),$A7,$C7)))))","v":"Augustin Filip  (Sokol STAR Turnov) - U19"},"3:0"]
[{"$f":"IF(AND($D8=\"\",$A8=\"\",$C8=\"\"),\"\",IF(AND($A8=\"\",$C8<>\"\"),$C8,IF(AND($A8<>\"\",$C8=\"\"),$A8,IF($D8=\"\",\"\",IF(LEFT($D8,1)<RIGHT($D8,1),$A8,$C8)))))","v":"Benešová  (Spartak Chrastava) - "},null,{"$f":"IF(AND($D9=\"\",$A9=\"\",$C9=\"\"),\"\",IF(AND($A9=\"\",$C9<>\"\"),$C9,IF(AND($A9<>\"\",$C9=\"\"),$A9,IF($D9=\"\",\"\",IF(LEFT($D9,1)<RIGHT($D9,1),$A9,$C9)))))","v":"Bitman Matěj  (KMST Liberec) - U15"},"3:0"]
["o 3. 4. místo"]
[{"$f":"IF($D18=\"\",\"\",IF(AND($A18=\"\",$C18<>\"\"),C18,IF(AND($A18<>\"\",$C18=\"\"),A18,IF(AND($A18=\"\",$C18=\"\"),\"\",IF(LEFT($D18,1)<RIGHT($D18,1),A18,C18)))))","v":"Bartoň David  (SKST Liberec) - U15"},null,{"$f":"IF($D19=\"\",\"\",IF(AND($A19=\"\",$C19<>\"\"),$C19,IF(AND($A19<>\"\",$C19=\"\"),$A19,IF(AND($A19=\"\",$C19=\"\"),\"\",IF(LEFT($D19,1)<RIGHT($D19,1),$A19,$C19)))))","v":"Brelka Zdeněk  (Viktoria Dětřichov) - U15"},"0:3"]
["o 7.-8. místo"]
[{"$f":"IF(AND($D11=\"\",$A11=\"\",$C11=\"\"),\"\",IF(AND($A11=\"\",$C11<>\"\"),$C11,IF(AND($A11<>\"\",$C11=\"\"),$A11,IF(AND($A11=\"\",$C11=\"\"),\"\",IF(LEFT($D11,1)<RIGHT($D11,1),$A11,$C11)))))","v":"Augustin Filip  (Sokol STAR Turnov) - U19"},null,{"$f":"IF(AND($D12=\"\",$A12=\"\",$C12=\"\"),\"\",IF(AND($A12=\"\",$C12<>\"\"),$C12,IF(AND($A12<>\"\",$C12=\"\"),$A12,IF(AND($A12=\"\",$C12=\"\"),\"\",IF(LEFT($D12,1)<RIGHT($D12,1),$A12,$C12)))))","v":"Bitman Matěj  (KMST Liberec) - U15"},"1:3"]
["o 1.-4. místo"]
[{"$f":"IF(AND($D6=\"\",$A6=\"\",$C6=\"\"),\"\",IF(AND($A6=\"\",$C6<>\"\"),$C6,IF(AND($A6<>\"\",$C6=\"\"),$A6,IF($D6=\"\",\"\",IF(LEFT($D6,1)>RIGHT($D6,1),$A6,$C6)))))","v":"Adamíra Šimon  (Sokol Tatobity) - U15"},null,{"$f":"IF(AND($D7=\"\",$A7=\"\",$C7=\"\"),\"\",IF(AND($A7=\"\",$C7<>\"\"),$C7,IF(AND($A7<>\"\",$C7=\"\"),$A7,IF($D7=\"\",\"\",IF(LEFT($D7,1)>RIGHT($D7,1),$A7,$C7)))))","v":"Bartoň David  (SKST Liberec) - U15"},"3:0"]
[{"$f":"IF(AND($D8=\"\",$A8=\"\",$C8=\"\"),\"\",IF(AND($A8=\"\",$C8<>\"\"),$C8,IF(AND($A8<>\"\",$C8=\"\"),$A8,IF($D8=\"\",\"\",IF(LEFT($D8,1)>RIGHT($D8,1),$A8,$C8)))))","v":"Berka Jan  (Bižuterie Jablonec n. N.) - U15"},null,{"$f":"IF(AND($D9=\"\",$A9=\"\",$C9=\"\"),\"\",IF(AND($A9=\"\",$C9<>\"\"),$C9,IF(AND($A9<>\"\",$C9=\"\"),$A9,IF($D9=\"\",\"\",IF(LEFT($D9,1)>RIGHT($D9,1),$A9,$C9)))))","v":"Brelka Zdeněk  (Viktoria Dětřichov) - U15"},"3:0"]
["5.-6. místo"]
[{"$f":"IF(AND($D11=\"\",$A11=\"\",$C11=\"\"),\"\",IF(AND($A11=\"\",$C11<>\"\"),$C11,IF(AND($A11<>\"\",$C11=\"\"),$A11,IF(AND($A11=\"\",$C11=\"\"),\"\",IF(LEFT($D11,1)>RIGHT($D11,1),$A11,$C11)))))","v":"Beneš Lukáš    (Spartak Chrastava) - "},null,{"$f":"IF(AND($D12=\"\",$A12=\"\",$C12=\"\"),\"\",IF(AND($A12=\"\",$C12<>\"\"),$C12,IF(AND($A12<>\"\",$C12=\"\"),$A12,IF(AND($A12=\"\",$C12=\"\"),\"\",IF(LEFT($D12,1)>RIGHT($D12,1),$A12,$C12)))))","v":"Benešová  (Spartak Chrastava) - "},"3:0"]
["o 1.-2. místo"]
[{"$f":"IF($D18=\"\",\"\",IF(AND($A18=\"\",$C18<>\"\"),C18,IF(AND($A18<>\"\",$C18=\"\"),A18,IF(AND($A18=\"\",$C18=\"\"),\"\",IF(LEFT($D18,1)>RIGHT($D18,1),A18,C18)))))","v":"Adamíra Šimon  (Sokol Tatobity) - U15"},null,{"$f":"IF($D19=\"\",\"\",IF(AND($A19=\"\",$C19<>\"\"),$C19,IF(AND($A19<>\"\",$C19=\"\"),$A19,IF(AND($A19=\"\",$C19=\"\"),\"\",IF(LEFT($D19,1)>RIGHT($D19,1),$A19,$C19)))))","v":"Berka Jan  (Bižuterie Jablonec n. N.) - U15"},"1:3"]
[{"$f":"IF($D23=\"\",\"\",IF(AND($A23=\"\",$C23<>\"\"),C23,IF(AND($A23<>\"\",$C23=\"\"),A23,IF(AND($A23=\"\",$C23=\"\"),\"\",IF(LEFT($D23,1)>RIGHT($D23,1),A23,C23)))))","v":"Berka Jan  (Bižuterie Jablonec n. N.) - U15"},null,"1. místo"]
[{"$f":"IF($D23=\"\",\"\",IF(AND($A23=\"\",$C23<>\"\"),C23,IF(AND($A23<>\"\",$C23=\"\"),A23,IF(AND($A23=\"\",$C23=\"\"),\"\",IF(LEFT($D23,1)<RIGHT($D23,1),A23,C23)))))","v":"Adamíra Šimon  (Sokol Tatobity) - U15"},null,"2. místo"]
[{"$f":"IF(AND($D14=\"\",$A14=\"\",$C14=\"\"),\"\",IF(AND($A14=\"\",$C14<>\"\"),$C14,IF(AND($A14<>\"\",$C14=\"\"),$A14,IF(AND($A14=\"\",$C14=\"\"),\"\",IF(LEFT($D14,1)>RIGHT($D14,1),$A14,$C14)))))","v":"Brelka Zdeněk  (Viktoria Dětřichov) - U15"},null,"3. místo"]
[{"$f":"IF(AND($D14=\"\",$A14=\"\",$C14=\"\"),\"\",IF(AND($A14=\"\",$C14<>\"\"),$C14,IF(AND($A14<>\"\",$C14=\"\"),$A14,IF(AND($A14=\"\",$C14=\"\"),\"\",IF(LEFT($D14,1)<RIGHT($D14,1),$A14,$C14)))))","v":"Bartoň David  (SKST Liberec) - U15"},null,"4. místo"]
[{"$f":"IF(AND($D21=\"\",$A21=\"\",$C21=\"\"),\"\",IF(AND($A21=\"\",$C21<>\"\"),$C21,IF(AND($A21<>\"\",$C21=\"\"),$A21,IF(AND($A21=\"\",$C21=\"\"),\"\",IF(LEFT($D21,1)>RIGHT($D21,1),$A21,$C21)))))","v":"Beneš Lukáš    (Spartak Chrastava) - "},null,"5. místo"]
[{"$f":"IF(AND($D21=\"\",$A21=\"\",$C21=\"\"),\"\",IF(AND($A21=\"\",$C21<>\"\"),$C21,IF(AND($A21<>\"\",$C21=\"\"),$A21,IF(AND($A21=\"\",$C21=\"\"),\"\",IF(LEFT($D21,1)<RIGHT($D21,1),$A21,$C21)))))","v":"Benešová  (Spartak Chrastava) - "},null,"6. místo"]
[{"$f":"IF(AND($D16=\"\",$A16=\"\",$C16=\"\"),\"\",IF(AND($A16=\"\",$C16<>\"\"),$C16,IF(AND($A16<>\"\",$C16=\"\"),$A16,IF(AND($A16=\"\",$C16=\"\"),\"\",IF(LEFT($D16,1)>RIGHT($D16,1),$A16,$C16)))))","v":"Bitman Matěj  (KMST Liberec) - U15"},null,"7. místo"]
[{"$f":"IF(AND($D16=\"\",$A16=\"\",$C16=\"\"),\"\",IF(AND($A16=\"\",$C16<>\"\"),$C16,IF(AND($A16<>\"\",$C16=\"\"),$A16,IF(AND($A16=\"\",$C16=\"\"),\"\",IF(LEFT($D16,1)<RIGHT($D16,1),$A16,$C16)))))","v":"Augustin Filip  (Sokol STAR Turnov) - U19"},null,"8. místo"]
[]
[]
[]
[]
[]
[]
[]
[]
[]
[]
[]
[]
[null,null,null,"."]

{"sheet":"5divize-A_2","index":21,"n_rows":40,"n_cols":4,"rows_kept":40,"cut":false,"hidden":true,"merged":[[0,1,0,2],[1,1,1,2],[2,1,2,2],[3,1,3,2]]}
["Název soutěže:",{"$f":"A_skupiny!A1","v":"10. KBT Libereckého kraje"}]
[]
["Kategorie, den",{"$f":"A_skupiny!A3","v":"Turnov, 14.05.2022"}]
["Kolo",{"$f":"'5divize-A'!B3:E3","v":"5. divize - o 1. - 8. místo"}]
[]
[{"$f":"'5divize-A'!A5","v":"o 1.-8. místo"}]
[{"$f":"IF('5divize-A'!A6=\"\",\"\",'5divize-A'!A6)","v":"Beneš Lukáš    (Spartak Chrastava) - "}]
[null,{"$f":"'5divize-A'!A18","v":"Adamíra Šimon  (Sokol Tatobity) - U15"}]
[{"$f":"IF('5divize-A'!C6=\"\",\"\",'5divize-A'!C6)","v":"Adamíra Šimon  (Sokol Tatobity) - U15"},{"$f":"IF('5divize-A'!D6=\"\",\"\",IF(LEFT('5divize-A'!D6,1)>RIGHT('5divize-A'!D6,1),'5divize-A'!D6,RIGHT('5divize-A'!D6,1)&\":\"&LEFT('5divize-A'!D6,1)))","v":"3:0"}]
[null,null,{"$f":"'5divize-A'!A23","v":"Adamíra Šimon  (Sokol Tatobity) - U15"}]
[{"$f":"IF('5divize-A'!A7=\"\",\"\",'5divize-A'!A7)","v":"Augustin Filip  (Sokol STAR Turnov) - U19"},null,{"$f":"IF('5divize-A'!D18=\"\",\"\",IF(LEFT('5divize-A'!D18,1)>RIGHT('5divize-A'!D18,1),'5divize-A'!D18,RIGHT('5divize-A'!D18,1)&\":\"&LEFT('5divize-A'!D18,1)))","v":"3:0"}]
[null,{"$f":"'5divize-A'!C18","v":"Bartoň David  (SKST Liberec) - U15"}]
[{"$f":"IF('5divize-A'!C7=\"\",\"\",'5divize-A'!C7)","v":"Bartoň David  (SKST Liberec) - U15"},{"$f":"IF('5divize-A'!D7=\"\",\"\",IF(LEFT('5divize-A'!D7,1)>RIGHT('5divize-A'!D7,1),'5divize-A'!D7,RIGHT('5divize-A'!D7,1)&\":\"&LEFT('5divize-A'!D7,1)))","v":"3:1"}]
[null,null,null,{"$f":"'5divize-A'!A24","v":"Berka Jan  (Bižuterie Jablonec n. N.) - U15"}]
[{"$f":"IF('5divize-A'!A8=\"\",\"\",'5divize-A'!A8)","v":"Benešová  (Spartak Chrastava) - "},null,null,{"$f":"IF('5divize-A'!D23=\"\",\"\",IF(LEFT('5divize-A'!D23,1)>RIGHT('5divize-A'!D23,1),'5divize-A'!D23,RIGHT('5divize-A'!D23,1)&\":\"&LEFT('5divize-A'!D23,1)))","v":"3:1"}]
[null,{"$f":"'5divize-A'!A19","v":"Berka Jan  (Bižuterie Jablonec n. N.) - U15"}]
[{"$f":"IF('5divize-A'!C8=\"\",\"\",'5divize-A'!C8)","v":"Berka Jan  (Bižuterie Jablonec n. N.) - U15"},{"$f":"IF('5divize-A'!D8=\"\",\"\",IF(LEFT('5divize-A'!D8,1)>RIGHT('5divize-A'!D8,1),'5divize-A'!D8,RIGHT('5divize-A'!D8,1)&\":\"&LEFT('5divize-A'!D8,1)))","v":"3:2"}]
[null,null,{"$f":"'5divize-A'!C23","v":"Berka Jan  (Bižuterie Jablonec n. N.) - U15"}]
[{"$f":"IF('5divize-A'!A9=\"\",\"\",'5divize-A'!A9)","v":"Bitman Matěj  (KMST Liberec) - U15"},null,{"$f":"IF('5divize-A'!D19=\"\",\"\",IF(LEFT('5divize-A'!D19,1)>RIGHT('5divize-A'!D19,1),'5divize-A'!D19,RIGHT('5divize-A'!D19,1)&\":\"&LEFT('5divize-A'!D19,1)))","v":"3:0"}]
[null,{"$f":"'5divize-A'!C19","v":"Brelka Zdeněk  (Viktoria Dětřichov) - U15"}]
[{"$f":"IF('5divize-A'!C9=\"\",\"\",'5divize-A'!C9)","v":"Brelka Zdeněk  (Viktoria Dětřichov) - U15"},{"$f":"IF('5divize-A'!D9=\"\",\"\",IF(LEFT('5divize-A'!D9,1)>RIGHT('5divize-A'!D9,1),'5divize-A'!D9,RIGHT('5divize-A'!D9,1)&\":\"&LEFT('5divize-A'!D9,1)))","v":"3:0"}]
[]
[{"$f":"'5divize-A'!A10","v":"o 5.-8. místo"}]
[{"$f":"IF('5divize-A'!A11=\"\",\"\",'5divize-A'!A11)","v":"Beneš Lukáš    (Spartak Chrastava) - "},null,{"$f":"IF('5divize-A'!D57=\"\",\"\",IF(LEFT('5divize-A'!D57,1)>RIGHT('5divize-A'!D57,1),'5divize-A'!D57,RIGHT('5divize-A'!D57,1)&\":\"&LEFT('5divize-A'!D57,1)))","v":""}]
[null,{"$f":"'5divize-A'!A21","v":"Beneš Lukáš    (Spartak Chrastava) - "}]
[{"$f":"IF('5divize-A'!C11=\"\",\"\",'5divize-A'!C11)","v":"Augustin Filip  (Sokol STAR Turnov) - U19"},{"$f":"IF('5divize-A'!D11=\"\",\"\",IF(LEFT('5divize-A'!D11,1)>RIGHT('5divize-A'!D11,1),'5divize-A'!D11,RIGHT('5divize-A'!D11,1)&\":\"&LEFT('5divize-A'!D11,1)))","v":"3:0"}]
[null,null,{"$f":"'5divize-A'!A28","v":"Beneš Lukáš    (Spartak Chrastava) - "}]
[{"$f":"IF('5divize-A'!A12=\"\",\"\",'5divize-A'!A12)","v":"Benešová  (Spartak Chrastava) - "},null,{"$f":"IF('5divize-A'!D21=\"\",\"\",IF(LEFT('5divize-A'!D21,1)>RIGHT('5divize-A'!D21,1),'5divize-A'!D21,RIGHT('5divize-A'!D21,1)&\":\"&LEFT('5divize-A'!D21,1)))","v":"3:0"}]
[null,{"$f":"'5divize-A'!C21","v":"Benešová  (Spartak Chrastava) - "}]
[{"$f":"IF('5divize-A'!C12=\"\",\"\",'5divize-A'!C12)","v":"Bitman Matěj  (KMST Liberec) - U15"},{"$f":"IF('5divize-A'!D12=\"\",\"\",IF(LEFT('5divize-A'!D12,1)>RIGHT('5divize-A'!D12,1),'5divize-A'!D12,RIGHT('5divize-A'!D12,1)&\":\"&LEFT('5divize-A'!D12,1)))","v":"3:0"}]
[]
[{"$f":"'5divize-A'!A13","v":"o 3. 4. místo"}]
[{"$f":"IF('5divize-A'!A14=\"\",\"\",'5divize-A'!A14)","v":"Bartoň David  (SKST Liberec) - U15"}]
[null,{"$f":"'5divize-A'!A26","v":"Brelka Zdeněk  (Viktoria Dětřichov) - U15"}]
[{"$f":"IF('5divize-A'!C14=\"\",\"\",'5divize-A'!C14)","v":"Brelka Zdeněk  (Viktoria Dětřichov) - U15"},{"$f":"IF('5divize-A'!D14=\"\",\"\",IF(LEFT('5divize-A'!D14,1)>RIGHT('5divize-A'!D14,1),'5divize-A'!D14,RIGHT('5divize-A'!D14,1)&\":\"&LEFT('5divize-A'!D14,1)))","v":"3:0"}]
[]
[{"$f":"'5divize-A'!A15","v":"o 7.-8. místo"}]
[{"$f":"IF('5divize-A'!A16=\"\",\"\",'5divize-A'!A16)","v":"Augustin Filip  (Sokol STAR Turnov) - U19"}]
[null,{"$f":"'5divize-A'!A30","v":"Bitman Matěj  (KMST Liberec) - U15"}]
[{"$f":"IF('5divize-A'!C16=\"\",\"\",'5divize-A'!C16)","v":"Bitman Matěj  (KMST Liberec) - U15"},{"$f":"IF('5divize-A'!D16=\"\",\"\",IF(LEFT('5divize-A'!D16,1)>RIGHT('5divize-A'!D16,1),'5divize-A'!D16,RIGHT('5divize-A'!D16,1)&\":\"&LEFT('5divize-A'!D16,1)))","v":"3:1"}]

{"sheet":"D_skupiny","index":22,"n_rows":39,"n_cols":9,"rows_kept":39,"cut":false,"hidden":false,"merged":[[37,1,37,2],[25,1,25,2],[29,1,29,2],[30,1,30,2],[31,1,31,2],[35,1,35,2],[18,1,18,2],[19,1,19,2],[23,1,23,2],[24,1,24,2],[36,1,36,2],[7,1,7,2],[11,1,11,2],[12,1,12,2],[13,1,13,2],[17,1,17,2],[0,0,0,8],[2,0,2,2],[3,0,3,1],[5,1,5,2],[6,1,6,2]]}
[{"$f":"A_skupiny!A1","v":"10. KBT Libereckého kraje"}]
[]
["Turnov - 14.05..2022"]
["Divize D - skupiny"]
[null,"skupina 1","škola/klub",1,2,3,4,"b","m"]
[1,"Jungmann Matěj  (SKST Liberec) - U11",null,"xxx","3:0","0:3",null,3,2]
[2,"Hájovská Lucie (AST Kam. Šenov) - U11",null,"0:3","xxx","0:3",null,2,3]
[3,"Smékalová Aneta (TTC Bělá p.B.) - U11",null,"3:0","3:0","xxx",null,4,1]
[4,null,null,null,null,null,"xxx"]
[]
[null,"skupina 2","škola/klub",1,2,3,4,"b","m"]
[1,"Resl Teodor (SKST Liberec) - U11",null,"xxx","1:3","1:3",null,2,3]
[2,"Michálek Petr (Jiskra Kam.  Šenov) - U13",null,"3:1","xxx","3:2",null,4,1]
[3,"Dohnal Richard (AST Kam. Šenov) - U17",null,"3:1","2:3","xxx",null,3,2]
[4,null,null,null,null,null,"xxx"]
[]
[null,"skupina 3","škola/klub",1,2,3,4,"b","m"]
[1,"Pavelková Terezie (Spartak Chrastava) - U15",null,"xxx","3:0","3:0",null,4,1]
[2,"Čečerle Matouš (KMST Liberec) - U15",null,"3:0","xxx","0:3",null,3,2]
[3,"Daníček Zdeněk (Jiskra Kam. Šenov) - U11",null,"0:3","3:0","xxx",null,2,3]
[4,null,null,null,null,null,"xxx"]
[]
[null,"skupina 4","škola/klub",1,2,3,4,"b","m"]
[1,"Hudák František (Bižu Jablonec) - U11",null,"xxx","3:0","3:0",null,4,1]
[2,"Zrník Vojtěch (KMST Liberec) - U11",null,"0:3","xxx","3:1",null,3,2]
[3,"Rejna Josef (AST Kam. Šenov) - U17",null,"0:3","1:3","xxx",null,2,3]
[4,null,null,null,null,null,"xxx"]
[]
[null,"skupina 5","škola/klub",1,2,3,4,"b","m"]
[1,"Holubová Barbora (STAR Turnov) - U13",null,"xxx","3:0","3:0",null,4,1]
[2,"Karásek Patrik (KMST Liberec) - U13",null,"0:3","xxx","3:0",null,3,2]
[3,"Kozák Jan (Bižu Jablonec) - U11",null,"0:3","0:3","xxx",null,2,3]
[4,null,null,null,null,null,"xxx"]
[]
[null,"skupina 6","škola/klub",1,2,3,4,"b","m"]
[1,"Jeřábek Jakub (Loko Česká Lípa - U15",null,"xxx","3:0","3:0",null,4,1]
[2,"Šrámek Matouš (KMST Liberec) - U11",null,"0:3","xxx","3:0",null,3,2]
[3,"Marek Radim (AST Kam. Šenov) - U17",null,"0:3","0:3","xxx",null,2,3]
[4,null,null,null,null,null,"xxx"]

{"sheet":"D_finale","index":23,"n_rows":64,"n_cols":6,"rows_kept":64,"cut":false,"hidden":false,"merged":[[51,0,51,1],[56,0,56,1],[0,0,0,1],[1,0,1,1],[1,2,1,3],[2,2,2,3],[37,0,37,1],[46,0,46,1]]}
["Název soutěže:",null,"10. KBT Libereckého kraje"]
["Kategorie, den",null,"2022-05-14"]
[null,"Kolo","Divize D, finále"]
[]
["1.","Smékalová (TTC Bělá p.B.) - U11"]
[null,null,"Smékalová (TTC Bělá p.B.) - U11"]
["2."]
[null,null,null,"Smékalová (TTC Bělá p.B.) - U11"]
["3.","Zrník Vojtěch (KMST Liberec) - U11",null,"3:0"]
[null,null,"Dohnal Richard (AST Kam. Šenov) -U17"]
["4.","Dohnal Richard (AST Kam. Šenov) -U17","3:0"]
[null,null,null,null,"Smékalová (TTC Bělá p.B.) - U11"]
["5.","Jeřábek Jakub (loko Česká L9pa) - U15",null,null,"3:0"]
[null,null,"Jeřábek Jakub (loko Česká L9pa) - U15"]
["6.","Karásek Patrik (KMST Liberec) - U13","3:1"]
[null,null,null,"Jeřábek Jakub (loko Česká L9pa) - U15"]
["7."," ",null,"3:1"]
[null,null,"Hudák František (Bižu Jablonec) - U11"]
["8.","Hudák František (Bižu Jablonec) - U11"]
[null,null,null,null,null,"Smékalová (TTC Bělá p.B.) - U11"]
["9.","Pavelková Terezie (Spartak Chrastava) - U15",null,null,null,"3:0"]
[null,null,"Pavelková Terezie (Spartak Chrastava) - U15"]
["10."]
[null,null,null,"Holubová Barbora (STAR Turnov) - U13"]
["11.","Šrámek Matouš (KMST Liberec) - U11",null,"3:0"]
[null,null,"Holubová Barbora (STAR Turnov) - U13"]
["12.","Holubová Barbora (STAR Turnov) - U13","3:0"]
[null,null,null,null,"Jungmann Matěj (SKST Liberec) - U11"]
["13.","Jungmann Matěj (SKST Liberec) - U11",null,null,"3:1"]
[null,null,"Jungmann Matěj (SKST Liberec) - U11"]
["14.","Čečerle Matopuš (KMST Liberec) - U15","3:1"]
[null,null,null,"Jungmann Matěj (SKST Liberec) - U11"]
["15.",null,null,"3:1"]
[null,null,"Michálek Petr (Jiskra Kam. Šenov) - U13"]
["16.","Michálek Petr (Jiskra Kam. Šenov) - U13"]
[]
[]
["o 5.-8. místo"]
[null,"Dohnal Richard (AST Kam. Šenov) -U17"]
[null,null,"Dohnal Richard (AST Kam. Šenov) -U17"]
[null,"Hudák František (Bižu Jablonec) - U11","3:1"]
[null,null,null,"Pavelková Terezie (Spartak Chrastava) - U15"]
[null,"Pavelková Terezie (Spartak Chrastava) - U15",null,"3:0"]
[null,null,"Pavelková Terezie (Spartak Chrastava) - U15"]
[null,"Michálek Petr (Jiskra Kam. Šenov) - U13","3:1"]
[]
["o 3.-4. místo"]
[null,"Jeřábek Jakub (loko Česká L9pa) - U15"]
[null,null,"Holubová Barbora (STAR Turnov) - U13"]
[null,"Holubová Barbora (STAR Turnov) - U13","3:2"]
[]
["o 7.-8. místo"]
[null,"Hudák František (Bižu Jablonec) - U11"]
[null,null,"Hudák František (Bižu Jablonec) - U11"]
[null,"Michálek Petr (Jiskra Kam. Šenov) - U13","3:2"]
[]
["o 9.-12. místo"]
[null,"Zrník Vojtěch (KMST Liberec) - U11"]
[null,null,"Karásek Patrik (KMST Liberec) - U13"]
[null,"Karásek Patrik (KMST Liberec) - U13","3:0"]
[null,null,null,"Karásek Patrik (KMST Liberec) - U13"]
[null,"Šrámek Matouš (KMST Liberec) - U11",null,"3:0"]
[null,null,"Šrámek Matouš (KMST Liberec) - U11"]
[null,"Čečerle Matopuš (KMST Liberec) - U15","3:2"]

{"sheet":"D_utecha","index":24,"n_rows":36,"n_cols":9,"rows_kept":36,"cut":false,"hidden":false,"merged":[[31,2,31,3],[0,0,0,1],[1,0,1,1],[1,2,1,3],[2,2,2,3],[24,2,24,3],[6,1,6,2],[7,1,7,2],[8,1,8,2],[12,1,12,2],[13,1,13,2],[14,1,14,2],[18,2,18,3]]}
["Název soutěže:",null,"10. KBT Libereckého kraje"]
["Kategorie, den",null,"2022-05-14"]
[null,"Kolo","Divize D, útěcha"]
[]
[]
[null,"skupina 1","škola/klub",1,2,3,4,"b","m"]
[1,"Hájovská Lucie (AST Kam. Šenov) - U11",null,"xxx","0:3","3:2",null,3,2]
[2,"Daníček Zdeněk (Jiskra Kam. Šenov) - U11",null,"3:0","xxx","3:0",null,4,1]
[3,"Kozák Jan (Bižu Jablonec) - U11",null,"2:3","0:3","xxx",null,2,3]
[4,null,null,null,null,null,"xxx"]
[]
[null,"skupina 2","škola/klub",1,2,3,4,"b","m"]
[1,"Resl Teodor (SKST Liberec) - U11",null,"xxx","3:0","3:0",null,4,1]
[2,"Rejna Josef (AST Kam. Šenov) - U17",null,"0:3","xxx","3:1",null,3,2]
[3,"Marek Radim (AST Kam. Šenov) - U17",null,"0:3","1:3","xxx",null,2,3]
[4,null,null,null,null,null,"xxx"]
[]
[]
[null,null,"o 13.- 14. místo"]
[]
[null,"Daníček Zdeněk (Jiskra Kam. Šenov) - U11"]
[null,null,"Resl Theodor (KMST Liberec) - U11"]
[null,"Resl Theodor (KMST Liberec) - U11","3:0"]
[]
[null,null,"o 15.- 16. místo"]
[]
[null,"Háýjovská Lucie (AST Kamn. Šenov) - U11"]
[null,null,"Rejna Josef (AST Kam. Šenov) - U17"]
[null,"Rejna Josef (AST Kam. Šenov) - U17","3:0"]
[]
[]
[null,null,"o 17.- 18. místo"]
[]
[null,"Kozák Jan (Bižu Jablonec) - U11"]
[null,null,"Kozák Jan (Bižu Jablonec) - U11"]
[null,"Marek Radim (AST Kam.  Šenov) - U17","3:0"]

{"sheet":"celkem","index":25,"n_rows":171,"n_cols":8,"rows_kept":171,"cut":false,"hidden":false,"merged":[[0,0,0,7],[1,0,1,7],[2,0,2,7],[12,5,12,6],[40,0,40,1],[4,0,4,1],[4,4,4,5],[22,0,22,1],[22,4,22,5]]}
["10. KBT Libereckého kraje"]
["Turnov, 14.05.2022"]
["celkové výsledky"]
[]
["Divize A",null,null,null,"Divize B"]
["1.","Němec Štěpán (SKST Liberec) - U15",null,null,"1.","Šedo Pavel (KMST Liberec) - U17",null,"↑"]
["2.","Wolf Filip (SKST Liberec) - U15",null,null,"2.","Nypl Patrik (Bižu Jablonec) - U13",null,"↑"]
["3.","Žmuda Petr (SKST Liberec) - U15",null,null,"3.","Košťák Matěj (Bižu Jablonec) - U15",null,"↑"]
["4.","Nohejl Václav (ST Frýdlant)- U17",null,null,"4.","Bartoň David (SKST Liberec) - U15"]
["5.","Nohejl Martin (ST Frýdlant) - U17",null,null,"5.","Krotilová Adéla (SKST Liberec) - U15"]
["6.","Nohejl Matěj (ST Frýdlant) - U17",null,null,"6.","Kožich Vítek (SKST Liberec) - U13"]
["7.","Vogel Jakub (SKST Liberec) U-17",null,null,"7.","Závětová Lucie (ST Frýdlant) - U19"]
["8.","Jandák Jan (SKST Liberec) - U19",null,null,"8.","Korpová Tereza (AST Kam. Šenov) - U11"]
["9.","Nováková Tereza (Spartak Chrastava) - U17",null,null,"9.","Kuntoš Filip   (SKST Liberec) - U17"]
["10.","Kovář Samuel (SKST Liebrec) - U13",null,null,"10.","Adamíra Šinmon (Orel Lomnice) - U15"]
["11.","Nechvíl Richard (Sokol Turnov) - U15",null,null,"11.","Königová Anežka (STAR Turnov) - U15"]
["12.","Pytlounová Nikola (SKST Liberec) - U15",null,null,"12.","Voplakala Vojtěch (SKST Liberec) - U11"]
["13.","Smékal Jiří (TTC Bělá p.B.) - U15",null,null,"13.","Günter Tomáš (KMST Liberec) - U13"]
["14.","Brož Kryštof (STAR Turnov) - U17","↓",null,"14.","Kubíček Tomáš (STAR Turnov) - U15",null,"↓"]
["15.","Csizmazia Antonín (Sokol Turnov) - U11","↓",null,"15.","Flégr Samuel (KMST Liberec) - U17",null,"↓"]
["16.","Rek Vít (Loko Česká Lípa) - U13","↓",null,"16.","Trojan Jáchym (KMST Liberec) - U13",null,"↓"]
[]
["Divize C",null,null,null,"Divize D"]
["1.","Bárta Tomáš (STAR Turnov) - U17","↑",null,"1.","Smékaloavá Adéla (TTC Bělá p.B.) - U11",null,"↑"]
["2.","Panáček Filip (Loko Česká Lípa) - U13","↑",null,"2.","Jungmann Matěj (SKST Liberec) - U11",null,"↑"]
["3.",{"$f":"'3divize-A'!A26","v":"Stach Vojtěch   (STAR Turnov) - U17"},"↑",null,"3.","Holubová Barbora(STAR Turnov) - U13",null,"↑"]
["4.","Rak Oliver (KMST Liberec) - U11",null,null,"4.","Jeřábek Jakub (Loko Česká Lípa) - U15"]
["5.","Vaněk Tomáš (SKST Liberec) - U19",null,null,"5.","Pavelková Terezie (Spartak Charstava) - U15"]
["6.","Krejčík Jan (Bižu Jablonec) - U13",null,null,"6.","Dohnal Richard (AST Kam. Šenov) - U17"]
["7.","Stejskal Šimon (SKST Liberec) - U13",null,null,"7.","Hudák František (Bižu Jablonec) -U11"]
["8.","Šulc Štěpán   (SKST Liberec) - U13",null,null,"8.","Michálek Petr (Jiskra Kam.  Šenov) - U13"]
["9.","Nohejl Vojtěch (ST Frýdlant - U13",null,null,"9.","Karásek Patrik (KMST Liberec) - U13"]
["10.","Valášek Šimon (KMST Liberec) - U11",null,null,"10.","Šrámek Matouš (KMST Liberec) - U11"]
["11.","Klinger Petr (Spartak Chrastava) - U13",null,null,"11.","Čečerle Matouš (KMST Liberec) - U15"]
["12.","Klineger Pavel (Spartak Chrastava) - U15",null,null,"12.","Zrník Vojtěch (KMST Liberec) - U11"]
["13.","Porš Zdeněk (SKST Liberec) - U17",null,null,"13.","Resl Teodor (SKST Liberec) - U11"]
["14.","Hanoušek Adam (STAR Turnov) - U13",null,null,"14.","Daníček Zdeněk (Jiskra Kam. Šenov) - U11"]
["15.","Cyprián Ondřej (SKST Liberec) - U13",null,null,"15.","Rejna Josef (AST Kam. Šenov) - U17"]
["16.","Motl Matyáš (KMST Liberec) - U13",null,null,"16.","Hájovská Lucie (AST Kam. Šenov) - U11"]
[null,null,null,null,"17.","Kozák Jan (Bižu Jasblonec) - U11"]
[null,null,null,null,"18.","Marek Radim (AST Kam. Šenov) - U17"]
[]
[]
[]
[]
[]
[]
[]
[]
[]
[]
[]
[]
[]
[]
[]
[]
[]
[]
[]
[]
[]
[]
[]
[]
[]
[]
[]
[]
[]
[]
[]
[]
[]
[]
[]
[]
[]
[]
[]
[]
[]
[]
[]
[]
[]
[]
[]
[]
[]
[]
[]
[]
[]
[]
[]
[]
[]
[]
[]
[]
[]
[]
[]
[]
[]
[]
[]
[]
[]
[]
[]
[]
[]
[]
[]
[]
[]
[]
[]
[]
[]
[]
[]
[]
[]
[]
[]
[]
[]
[]
[]
[]
[]
[]
[]
[]
[]
[]
[]
[]
[]
[]
[]
[]
[]
[]
[]
[]
[]
[]
[]
[]
[]
[]
[]
[]
[]
[]
[]
[]
[]
[]
[]
[]
[]
[]
[]
[]
[]
[null,null,null,null,null,7]

{"sheet":"utecha_umisteni_3","index":26,"n_rows":25,"n_cols":5,"rows_kept":25,"cut":false,"hidden":true,"merged":[[0,1,0,4],[1,1,1,4],[2,1,2,4]]}
["Název souteže:",{"$f":"A_skupiny!A1","v":"10. KBT Libereckého kraje"}]
["Kategorie, den",{"$f":"A_skupiny!A3","v":"Turnov, 14.05.2022"}]
["Kolo","o umístění"]
[null,null,null,"výsledek","wo"]
["o 25.-32. místo"]
["Šedo Pavel  (KMST Liberec) - U17",null,"Hanus Antonín  (Jiskra Kamenický Šenov) - U15","3:1"]
["Rambousek Jan  (Spartak Chrastava) - U15",null,"Krotilová Adéla  (SKST Liberec) - U15","2:3"]
["Hanus Ondřej  (Jiskra Kamenický Šenov) - U13",null,"Rek Vít  (Loko Česká Lípa) - U13","3:2"]
["Panáček Filip  (Loko Česká Lípa) - U13",null,"Pytlounová Nikola  (SKST Liberec) - U15","3:2"]
["o 21.-24 místo"]
["Černohub Vít  (Jiskra Nový Bor) - U13",null,"Holasová Sofie  (SKST Liberec) - U15","3:0"]
["Klustová  (Spartak Chrastava) - ",null,"Kosař Václav  (Sokol Turnov) - U19","0:3"]
["o 19.-20. místo"]
["Ortová Pavlína  (SKST Liberec) - U13",null,"Veselý Michal  (Kosmonosy) - U15","1:3"]
[]
["2. kolo"]
[{"$f":"IF(AND($D6=\"\",$A6=\"\",$C6=\"\"),\"\",IF(AND($A6=\"\",$C6<>\"\"),$C6,IF(AND($A6<>\"\",$C6=\"\"),$A6,IF($D6=\"\",\"\",IF(LEFT($D6,1)>RIGHT($D6,1),$A6,$C6)))))","v":"Šedo Pavel  (KMST Liberec) - U17"},null,{"$f":"IF(AND($D7=\"\",$A7=\"\",$C7=\"\"),\"\",IF(AND($A7=\"\",$C7<>\"\"),$C7,IF(AND($A7<>\"\",$C7=\"\"),$A7,IF($D7=\"\",\"\",IF(LEFT($D7,1)>RIGHT($D7,1),$A7,$C7)))))","v":"Krotilová Adéla  (SKST Liberec) - U15"},"1:3"]
[{"$f":"IF(AND($D8=\"\",$A8=\"\",$C8=\"\"),\"\",IF(AND($A8=\"\",$C8<>\"\"),$C8,IF(AND($A8<>\"\",$C8=\"\"),$A8,IF($D8=\"\",\"\",IF(LEFT($D8,1)>RIGHT($D8,1),$A8,$C8)))))","v":"Hanus Ondřej  (Jiskra Kamenický Šenov) - U13"},null,{"$f":"IF(AND($D9=\"\",$A9=\"\",$C9=\"\"),\"\",IF(AND($A9=\"\",$C9<>\"\"),$C9,IF(AND($A9<>\"\",$C9=\"\"),$A9,IF($D9=\"\",\"\",IF(LEFT($D9,1)>RIGHT($D9,1),$A9,$C9)))))","v":"Panáček Filip  (Loko Česká Lípa) - U13"},"1:3"]
[{"$f":"IF(AND($D11=\"\",$A11=\"\",$C11=\"\"),\"\",IF(AND($A11=\"\",$C11<>\"\"),$C11,IF(AND($A11<>\"\",$C11=\"\"),$A11,IF($D11=\"\",\"\",IF(LEFT($D11,1)>RIGHT($D11,1),$A11,$C11)))))","v":"Černohub Vít  (Jiskra Nový Bor) - U13"},null,{"$f":"IF(AND($D12=\"\",$A12=\"\",$C12=\"\"),\"\",IF(AND($A12=\"\",$C12<>\"\"),$C12,IF(AND($A12<>\"\",$C12=\"\"),$A12,IF($D12=\"\",\"\",IF(LEFT($D12,1)>RIGHT($D12,1),$A12,$C12)))))","v":"Kosař Václav  (Sokol Turnov) - U19"},"2:3"]
[{"$f":"IF($D14=\"\",\"\",IF(AND($A14=\"\",$C14<>\"\"),C14,IF(AND($A14<>\"\",$C14=\"\"),A14,IF(AND($A14=\"\",$C14=\"\"),\"\",IF(LEFT($D14,1)>RIGHT($D14,1),A14,C14)))))","v":"Veselý Michal  (Kosmonosy) - U15"},null,{"$f":"IF(AND($D15=\"\",$A15=\"\",$C15=\"\"),\"\",IF(AND($A15=\"\",$C15<>\"\"),$C15,IF(AND($A15<>\"\",$C15=\"\"),$A15,IF(AND($A15=\"\",$C15=\"\"),\"\",IF(LEFT($D15,1)>RIGHT($D15,1),$A15,$C15)))))","v":""}]
["Semifinále"]
[{"$f":"IF($D17=\"\",\"\",IF(AND($A17=\"\",$C17<>\"\"),C17,IF(AND($A17<>\"\",$C17=\"\"),A17,IF(AND($A17=\"\",$C17=\"\"),\"\",IF(LEFT($D17,1)>RIGHT($D17,1),A17,C17)))))","v":"Krotilová Adéla  (SKST Liberec) - U15"},null,{"$f":"IF($D18=\"\",\"\",IF(AND($A18=\"\",$C18<>\"\"),$C18,IF(AND($A18<>\"\",$C18=\"\"),$A18,IF(AND($A18=\"\",$C18=\"\"),\"\",IF(LEFT($D18,1)>RIGHT($D18,1),$A18,$C18)))))","v":"Panáček Filip  (Loko Česká Lípa) - U13"},"1:3"]
[{"$f":"IF($D19=\"\",\"\",IF(AND($A19=\"\",$C19<>\"\"),C19,IF(AND($A19<>\"\",$C19=\"\"),A19,IF(AND($A19=\"\",$C19=\"\"),\"\",IF(LEFT($D19,1)>RIGHT($D19,1),A19,C19)))))","v":"Kosař Václav  (Sokol Turnov) - U19"}]
["Finále"]
[{"$f":"IF($D22=\"\",\"\",IF(AND($A22=\"\",$C22<>\"\"),C22,IF(AND($A22<>\"\",$C22=\"\"),A22,IF(AND($A22=\"\",$C22=\"\"),\"\",IF(LEFT($D22,1)>RIGHT($D22,1),A22,C22)))))","v":"Panáček Filip  (Loko Česká Lípa) - U13"}]

{"sheet":"utecha_umisteni_4","index":27,"n_rows":35,"n_cols":4,"rows_kept":35,"cut":false,"hidden":true,"merged":[[0,1,0,2],[1,1,1,2],[2,1,2,2],[3,1,3,2]]}
["Název soutěže:",{"$f":"A_skupiny!A1","v":"10. KBT Libereckého kraje"}]
[]
["Kategorie, den",{"$f":"A_skupiny!A3","v":"Turnov, 14.05.2022"}]
["Kolo","o umístění"]
[]
[{"$f":"utecha_umisteni_3!A5","v":"o 25.-32. místo"}]
[{"$f":"IF(utecha_umisteni_3!A6=\"\",\"\",utecha_umisteni_3!A6)","v":"Šedo Pavel  (KMST Liberec) - U17"}]
[null,{"$f":"utecha_umisteni_3!A17","v":"Šedo Pavel  (KMST Liberec) - U17"}]
[{"$f":"IF(utecha_umisteni_3!C6=\"\",\"\",utecha_umisteni_3!C6)","v":"Hanus Antonín  (Jiskra Kamenický Šenov) - U15"},{"$f":"IF(utecha_umisteni_3!D6=\"\",\"\",IF(LEFT(utecha_umisteni_3!D6,1)>RIGHT(utecha_umisteni_3!D6,1),utecha_umisteni_3!D6,RIGHT(utecha_umisteni_3!D6,1)&\":\"&LEFT(utecha_umisteni_3!D6,1)))","v":"3:1"}]
[null,null,{"$f":"utecha_umisteni_3!A22","v":"Krotilová Adéla  (SKST Liberec) - U15"}]
[{"$f":"IF(utecha_umisteni_3!A7=\"\",\"\",utecha_umisteni_3!A7)","v":"Rambousek Jan  (Spartak Chrastava) - U15"},null,{"$f":"IF(utecha_umisteni_3!D17=\"\",\"\",IF(LEFT(utecha_umisteni_3!D17,1)>RIGHT(utecha_umisteni_3!D17,1),utecha_umisteni_3!D17,RIGHT(utecha_umisteni_3!D17,1)&\":\"&LEFT(utecha_umisteni_3!D17,1)))","v":"3:1"}]
[null,{"$f":"utecha_umisteni_3!C17","v":"Krotilová Adéla  (SKST Liberec) - U15"}]
[{"$f":"IF(utecha_umisteni_3!C7=\"\",\"\",utecha_umisteni_3!C7)","v":"Krotilová Adéla  (SKST Liberec) - U15"},{"$f":"IF(utecha_umisteni_3!D7=\"\",\"\",IF(LEFT(utecha_umisteni_3!D7,1)>RIGHT(utecha_umisteni_3!D7,1),utecha_umisteni_3!D7,RIGHT(utecha_umisteni_3!D7,1)&\":\"&LEFT(utecha_umisteni_3!D7,1)))","v":"3:2"}]
[null,null,null,{"$f":"utecha_umisteni_3!A25","v":"Panáček Filip  (Loko Česká Lípa) - U13"}]
[{"$f":"IF(utecha_umisteni_3!A8=\"\",\"\",utecha_umisteni_3!A8)","v":"Hanus Ondřej  (Jiskra Kamenický Šenov) - U13"},null,null,{"$f":"IF(utecha_umisteni_3!D22=\"\",\"\",IF(LEFT(utecha_umisteni_3!D22,1)>RIGHT(utecha_umisteni_3!D22,1),utecha_umisteni_3!D22,RIGHT(utecha_umisteni_3!D22,1)&\":\"&LEFT(utecha_umisteni_3!D22,1)))","v":"3:1"}]
[null,{"$f":"utecha_umisteni_3!A18","v":"Hanus Ondřej  (Jiskra Kamenický Šenov) - U13"}]
[{"$f":"IF(utecha_umisteni_3!C8=\"\",\"\",utecha_umisteni_3!C8)","v":"Rek Vít  (Loko Česká Lípa) - U13"},{"$f":"IF(utecha_umisteni_3!D8=\"\",\"\",IF(LEFT(utecha_umisteni_3!D8,1)>RIGHT(utecha_umisteni_3!D8,1),utecha_umisteni_3!D8,RIGHT(utecha_umisteni_3!D8,1)&\":\"&LEFT(utecha_umisteni_3!D8,1)))","v":"3:2"}]
[null,null,{"$f":"utecha_umisteni_3!C22","v":"Panáček Filip  (Loko Česká Lípa) - U13"}]
[{"$f":"IF(utecha_umisteni_3!A9=\"\",\"\",utecha_umisteni_3!A9)","v":"Panáček Filip  (Loko Česká Lípa) - U13"},null,{"$f":"IF(utecha_umisteni_3!D18=\"\",\"\",IF(LEFT(utecha_umisteni_3!D18,1)>RIGHT(utecha_umisteni_3!D18,1),utecha_umisteni_3!D18,RIGHT(utecha_umisteni_3!D18,1)&\":\"&LEFT(utecha_umisteni_3!D18,1)))","v":"3:1"}]
[null,{"$f":"utecha_umisteni_3!C18","v":"Panáček Filip  (Loko Česká Lípa) - U13"}]
[{"$f":"IF(utecha_umisteni_3!C9=\"\",\"\",utecha_umisteni_3!C9)","v":"Pytlounová Nikola  (SKST Liberec) - U15"},{"$f":"IF(utecha_umisteni_3!D9=\"\",\"\",IF(LEFT(utecha_umisteni_3!D9,1)>RIGHT(utecha_umisteni_3!D9,1),utecha_umisteni_3!D9,RIGHT(utecha_umisteni_3!D9,1)&\":\"&LEFT(utecha_umisteni_3!D9,1)))","v":"3:2"}]
[]
[{"$f":"utecha_umisteni_3!A10","v":"o 21.-24 místo"}]
[{"$f":"IF(utecha_umisteni_3!A11=\"\",\"\",utecha_umisteni_3!A11)","v":"Černohub Vít  (Jiskra Nový Bor) - U13"},null,{"$f":"IF(utecha_umisteni_3!D51=\"\",\"\",IF(LEFT(utecha_umisteni_3!D51,1)>RIGHT(utecha_umisteni_3!D51,1),utecha_umisteni_3!D51,RIGHT(utecha_umisteni_3!D51,1)&\":\"&LEFT(utecha_umisteni_3!D51,1)))","v":""}]
[null,{"$f":"utecha_umisteni_3!A19","v":"Černohub Vít  (Jiskra Nový Bor) - U13"}]
[{"$f":"IF(utecha_umisteni_3!C11=\"\",\"\",utecha_umisteni_3!C11)","v":"Holasová Sofie  (SKST Liberec) - U15"},{"$f":"IF(utecha_umisteni_3!D11=\"\",\"\",IF(LEFT(utecha_umisteni_3!D11,1)>RIGHT(utecha_umisteni_3!D11,1),utecha_umisteni_3!D11,RIGHT(utecha_umisteni_3!D11,1)&\":\"&LEFT(utecha_umisteni_3!D11,1)))","v":"3:0"}]
[null,null,{"$f":"utecha_umisteni_3!A23","v":"Kosař Václav  (Sokol Turnov) - U19"}]
[{"$f":"IF(utecha_umisteni_3!A12=\"\",\"\",utecha_umisteni_3!A12)","v":"Klustová  (Spartak Chrastava) - "},null,{"$f":"IF(utecha_umisteni_3!D19=\"\",\"\",IF(LEFT(utecha_umisteni_3!D19,1)>RIGHT(utecha_umisteni_3!D19,1),utecha_umisteni_3!D19,RIGHT(utecha_umisteni_3!D19,1)&\":\"&LEFT(utecha_umisteni_3!D19,1)))","v":"3:2"}]
[null,{"$f":"utecha_umisteni_3!C19","v":"Kosař Václav  (Sokol Turnov) - U19"}]
[{"$f":"IF(utecha_umisteni_3!C12=\"\",\"\",utecha_umisteni_3!C12)","v":"Kosař Václav  (Sokol Turnov) - U19"},{"$f":"IF(utecha_umisteni_3!D12=\"\",\"\",IF(LEFT(utecha_umisteni_3!D12,1)>RIGHT(utecha_umisteni_3!D12,1),utecha_umisteni_3!D12,RIGHT(utecha_umisteni_3!D12,1)&\":\"&LEFT(utecha_umisteni_3!D12,1)))","v":"3:0"}]
[]
[{"$f":"utecha_umisteni_3!A13","v":"o 19.-20. místo"}]
[{"$f":"IF(utecha_umisteni_3!A14=\"\",\"\",utecha_umisteni_3!A14)","v":"Ortová Pavlína  (SKST Liberec) - U13"}]
[null,{"$f":"utecha_umisteni_3!A20","v":"Veselý Michal  (Kosmonosy) - U15"}]
[{"$f":"IF(utecha_umisteni_3!C14=\"\",\"\",utecha_umisteni_3!C14)","v":"Veselý Michal  (Kosmonosy) - U15"},{"$f":"IF(utecha_umisteni_3!D14=\"\",\"\",IF(LEFT(utecha_umisteni_3!D14,1)>RIGHT(utecha_umisteni_3!D14,1),utecha_umisteni_3!D14,RIGHT(utecha_umisteni_3!D14,1)&\":\"&LEFT(utecha_umisteni_3!D14,1)))","v":"3:1"}]

{"sheet":"utecha_umisteni_5","index":28,"n_rows":43,"n_cols":7,"rows_kept":43,"cut":false,"hidden":true,"merged":[[7,0,7,1],[7,3,7,4],[0,0,0,1],[0,2,0,6],[1,0,1,1],[1,2,1,6],[2,0,2,1],[2,2,2,6],[4,0,4,1],[5,0,5,1],[5,3,5,4],[6,0,6,1],[6,3,6,4],[8,0,8,1],[8,3,8,4],[9,0,9,1],[9,3,9,4],[10,0,10,1],[10,3,10,4],[11,0,11,1],[11,3,11,4],[12,0,12,1],[12,3,12,4],[13,0,13,1],[13,3,13,4],[14,0,14,1],[14,3,14,4],[15,0,15,1],[15,3,15,4],[16,0,16,1],[16,3,16,4],[17,0,17,1],[17,3,17,4],[18,0,18,1],[18,3,18,4],[19,0,19,1],[19,3,19,4],[20,0,20,1],[20,3,20,4],[21,0,21,1],[21,3,21,4],[22,0,22,1],[22,3,22,4],[23,0,23,1],[23,3,23,4],[25,0,25,1],[25,3,25,4],[26,0,26,1],[26,3,26,4],[27,0,27,1],[27,3,27,4],[28,0,28,1],[28,3,28,4],[29,0,29,1],[29,3,29,4],[30,0,30,1],[30,3,30,4],[31,0,31,1],[31,3,31,4],[32,0,32,1],[32,3,32,4],[34,0,34,1],[34,3,34,4],[35,0,35,1],[35,3,35,4],[36,0,36,1],[36,3,36,4],[42,0,42,1],[42,3,42,4],[37,0,37,1],[37,3,37,4],[39,0,39,1],[39,3,39,4],[40,0,40,1],[40,3,40,4]]}
["Název souteže:",null,{"$f":"A_skupiny!A1","v":"10. KBT Libereckého kraje"}]
["Kategorie, den",null,{"$f":"A_skupiny!A3","v":"Turnov, 14.05.2022"}]
["Kolo",null,"útěcha"]
[null,null,null,null,null,"výsledek","wo"]
["o 49. - 64. místo"]
["Hanoušek Adam  (Sokol Turnov) - U13",null,null,"Fišer Václav  (KMST Liberec) - U15",null,"0:3"]
["Resl Teodor  (SKST Liberec) - U11",null,null,"Sulovský Kryštof  (KMST Liberec) - U11",null,"3:0"]
["Benešová  (Spartak Chrastava) - ",null,null,"Bitman Matěj  (KMST Liberec) - U15",null,"0:3"]
["Čupcová Valerie  (Jiskra Nový Bor) - U11",null,null,"Táborský Václav  (Sokol STAR Turnov) - U13",null,"0:3"]
["Bartoň David  (SKST Liberec) - U15",null,null,"Severýn Kryštof  (Spartak Chrastava) - U13",null,"3:0"]
[]
["Šerpán Radek  (Sokol Turnov) - U15",null,null,"Adamíra Šimon  (Sokol Tatobity) - U15",null,"1:3"]
["Žagan Štěpán  (KMST Liberec) - U15",null,null,"Kutěj Štěpán  (Sokol Turnov) - U15",null,"2:3"]
["o 41. - 48. místo"]
["Kovář Samuel  (SKST Liberec) - U13",null,null,"Vrběcký Daniel  (Bižuterie Jablonec n. N.) - U17",null,"3:0"]
["Hanusová Karolína  (Jiskra Kamenický Šenov) - U13",null,null,"Perlík Josef  (KMST Liberec) - U11",null,"0:3"]
["Kubíček Tomáš  (Sokol Turnov) - U15",null,null,"Šťastný Jiří  (KMST Liberec) - U13",null,"3:0"]
["Hůlková Anna  (SKST Liberec) - U17",null,null,"Opluštil Jan  (Sokol STAR Turnov) - U17",null,"3:0"]
["o 37. - 40.  místo"]
["Závětová Lucie  (ST Frýdlant) - U19",null,null,"Motlík Denis  (Loko Česká Lípa) - U15",null,"3:0"]
["Flégr Samuel  (KMST Liberec) - ",null,null,"Korpová Tereza  (AST Kamenický Šenov) - U11",null,"0:3"]
["o 35. - 36. místo"]
["Kuntoš Filip  (SKST Liberec) - U17",null,null,"Königová Anežka  (Sokol STAR Turnov) - U15",null,"3:0"]
[]
["2. kolo"]
[{"$f":"IF(AND($F6=\"\",$A6=\"\",$D6=\"\"),\"\",IF(AND($A6=\"\",$D6<>\"\"),$D6,IF(AND($A6<>\"\",$D6=\"\"),$A6,IF(AND($A6=\"\",$D6=\"\"),\"\",IF(LEFT($F6,1)>RIGHT($F6,1),$A6,$D6)))))","v":"Fišer Václav  (KMST Liberec) - U15"},null,null,{"$f":"IF(AND($F7=\"\",$A7=\"\",$D7=\"\"),\"\",IF(AND($A7=\"\",$D7<>\"\"),$D7,IF(AND($A7<>\"\",$D7=\"\"),$A7,IF(AND($A7=\"\",$D7=\"\"),\"\",IF(LEFT($F7,1)>RIGHT($F7,1),$A7,$D7)))))","v":"Resl Teodor  (SKST Liberec) - U11"},null,"3:0"]
[{"$f":"IF(AND($F8=\"\",$A8=\"\",$D8=\"\"),\"\",IF(AND($A8=\"\",$D8<>\"\"),$D8,IF(AND($A8<>\"\",$D8=\"\"),$A8,IF(AND($A8=\"\",$D8=\"\"),\"\",IF(LEFT($F8,1)>RIGHT($F8,1),$A8,$D8)))))","v":"Bitman Matěj  (KMST Liberec) - U15"},null,null,{"$f":"IF(AND($F9=\"\",$A9=\"\",$D9=\"\"),\"\",IF(AND($A9=\"\",$D9<>\"\"),$D9,IF(AND($A9<>\"\",$D9=\"\"),$A9,IF(AND($A9=\"\",$D9=\"\"),\"\",IF(LEFT($F9,1)>RIGHT($F9,1),$A9,$D9)))))","v":"Táborský Václav  (Sokol STAR Turnov) - U13"},null,"1:3"]
[{"$f":"IF(AND($F10=\"\",$A10=\"\",$D10=\"\"),\"\",IF(AND($A10=\"\",$D10<>\"\"),$D10,IF(AND($A10<>\"\",$D10=\"\"),$A10,IF(AND($A10=\"\",$D10=\"\"),\"\",IF(LEFT($F10,1)>RIGHT($F10,1),$A10,$D10)))))","v":"Bartoň David  (SKST Liberec) - U15"},null,null,{"$f":"IF(AND($F11=\"\",$A11=\"\",$D11=\"\"),\"\",IF(AND($A11=\"\",$D11<>\"\"),$D11,IF(AND($A11<>\"\",$D11=\"\"),$A11,IF(AND($A11=\"\",$D11=\"\"),\"\",IF(LEFT($F11,1)>RIGHT($F11,1),$A11,$D11)))))","v":""}]
[{"$f":"IF(AND($F12=\"\",$A12=\"\",$D12=\"\"),\"\",IF(AND($A12=\"\",$D12<>\"\"),$D12,IF(AND($A12<>\"\",$D12=\"\"),$A12,IF(AND($A12=\"\",$D12=\"\"),\"\",IF(LEFT($F12,1)>RIGHT($F12,1),$A12,$D12)))))","v":"Adamíra Šimon  (Sokol Tatobity) - U15"},null,null,{"$f":"IF(AND($F13=\"\",$A13=\"\",$D13=\"\"),\"\",IF(AND($A13=\"\",$D13<>\"\"),$D13,IF(AND($A13<>\"\",$D13=\"\"),$A13,IF(AND($A13=\"\",$D13=\"\"),\"\",IF(LEFT($F13,1)>RIGHT($F13,1),$A13,$D13)))))","v":"Kutěj Štěpán  (Sokol Turnov) - U15"},null,"3:1"]
[{"$f":"IF(AND($F15=\"\",$A15=\"\",$D15=\"\"),\"\",IF(AND($A15=\"\",$D15<>\"\"),$D15,IF(AND($A15<>\"\",$D15=\"\"),$A15,IF(AND($A15=\"\",$D15=\"\"),\"\",IF(LEFT($F15,1)>RIGHT($F15,1),$A15,$D15)))))","v":"Kovář Samuel  (SKST Liberec) - U13"},null,null,{"$f":"IF(AND($F16=\"\",$A16=\"\",$D16=\"\"),\"\",IF(AND($A16=\"\",$D16<>\"\"),$D16,IF(AND($A16<>\"\",$D16=\"\"),$A16,IF(AND($A16=\"\",$D16=\"\"),\"\",IF(LEFT($F16,1)>RIGHT($F16,1),$A16,$D16)))))","v":"Perlík Josef  (KMST Liberec) - U11"},null,"3:0"]
[{"$f":"IF(AND($F17=\"\",$A17=\"\",$D17=\"\"),\"\",IF(AND($A17=\"\",$D17<>\"\"),$D17,IF(AND($A17<>\"\",$D17=\"\"),$A17,IF(AND($A17=\"\",$D17=\"\"),\"\",IF(LEFT($F17,1)>RIGHT($F17,1),$A17,$D17)))))","v":"Kubíček Tomáš  (Sokol Turnov) - U15"},null,null,{"$f":"IF(AND($F18=\"\",$A18=\"\",$D18=\"\"),\"\",IF(AND($A18=\"\",$D18<>\"\"),$D18,IF(AND($A18<>\"\",$D18=\"\"),$A18,IF(AND($A18=\"\",$D18=\"\"),\"\",IF(LEFT($F18,1)>RIGHT($F18,1),$A18,$D18)))))","v":"Hůlková Anna  (SKST Liberec) - U17"},null,"0:3"]
[{"$f":"IF(AND($F20=\"\",$A20=\"\",$D20=\"\"),\"\",IF(AND($A20=\"\",$D20<>\"\"),$D20,IF(AND($A20<>\"\",$D20=\"\"),$A20,IF(AND($A20=\"\",$D20=\"\"),\"\",IF(LEFT($F20,1)>RIGHT($F20,1),$A20,$D20)))))","v":"Závětová Lucie  (ST Frýdlant) - U19"},null,null,{"$f":"IF(AND($F21=\"\",$A21=\"\",$D21=\"\"),\"\",IF(AND($A21=\"\",$D21<>\"\"),$D21,IF(AND($A21<>\"\",$D21=\"\"),$A21,IF(AND($A21=\"\",$D21=\"\"),\"\",IF(LEFT($F21,1)>RIGHT($F21,1),$A21,$D21)))))","v":"Korpová Tereza  (AST Kamenický Šenov) - U11"},null,"3:1"]
[{"$f":"IF(AND($F23=\"\",$A23=\"\",$D23=\"\"),\"\",IF(AND($A23=\"\",$D23<>\"\"),$D23,IF(AND($A23<>\"\",$D23=\"\"),$A23,IF(AND($A23=\"\",$D23=\"\"),\"\",IF(LEFT($F23,1)>RIGHT($F23,1),$A23,$D23)))))","v":"Kuntoš Filip  (SKST Liberec) - U17"},null,null,{"$f":"IF(AND($F24=\"\",$A24=\"\",$D24=\"\"),\"\",IF(AND($A24=\"\",$D24<>\"\"),$D24,IF(AND($A24<>\"\",$D24=\"\"),$A24,IF(AND($A24=\"\",$D24=\"\"),\"\",IF(LEFT($F24,1)>RIGHT($F24,1),$A24,$D24)))))","v":""}]
["Čtvrtfinále"]
[{"$f":"IF(AND($F26=\"\",$A26=\"\",$D26=\"\"),\"\",IF(AND($A26=\"\",$D26<>\"\"),$D26,IF(AND($A26<>\"\",$D26=\"\"),$A26,IF(AND($A26=\"\",$D26=\"\"),\"\",IF(LEFT($F26,1)>RIGHT($F26,1),$A26,$D26)))))","v":"Fišer Václav  (KMST Liberec) - U15"},null,null,{"$f":"IF(AND($F27=\"\",$A27=\"\",$D27=\"\"),\"\",IF(AND($A27=\"\",$D27<>\"\"),$D27,IF(AND($A27<>\"\",$D27=\"\"),$A27,IF(AND($A27=\"\",$D27=\"\"),\"\",IF(LEFT($F27,1)>RIGHT($F27,1),$A27,$D27)))))","v":"Táborský Václav  (Sokol STAR Turnov) - U13"},null,"0:3"]
[{"$f":"IF(AND($F28=\"\",$A28=\"\",$D28=\"\"),\"\",IF(AND($A28=\"\",$D28<>\"\"),$D28,IF(AND($A28<>\"\",$D28=\"\"),$A28,IF(AND($A28=\"\",$D28=\"\"),\"\",IF(LEFT($F28,1)>RIGHT($F28,1),$A28,$D28)))))","v":"Bartoň David  (SKST Liberec) - U15"},null,null,{"$f":"IF(AND($F29=\"\",$A29=\"\",$D29=\"\"),\"\",IF(AND($A29=\"\",$D29<>\"\"),$D29,IF(AND($A29<>\"\",$D29=\"\"),$A29,IF(AND($A29=\"\",$D29=\"\"),\"\",IF(LEFT($F29,1)>RIGHT($F29,1),$A29,$D29)))))","v":"Adamíra Šimon  (Sokol Tatobity) - U15"},null,"1:3"]
[{"$f":"IF(AND($F30=\"\",$A30=\"\",$D30=\"\"),\"\",IF(AND($A30=\"\",$D30<>\"\"),$D30,IF(AND($A30<>\"\",$D30=\"\"),$A30,IF(AND($A30=\"\",$D30=\"\"),\"\",IF(LEFT($F30,1)>RIGHT($F30,1),$A30,$D30)))))","v":"Kovář Samuel  (SKST Liberec) - U13"},null,null,{"$f":"IF(AND($F31=\"\",$A31=\"\",$D31=\"\"),\"\",IF(AND($A31=\"\",$D31<>\"\"),$D31,IF(AND($A31<>\"\",$D31=\"\"),$A31,IF(AND($A31=\"\",$D31=\"\"),\"\",IF(LEFT($F31,1)>RIGHT($F31,1),$A31,$D31)))))","v":"Hůlková Anna  (SKST Liberec) - U17"}]
[{"$f":"IF(AND($F32=\"\",$A32=\"\",$D32=\"\"),\"\",IF(AND($A32=\"\",$D32<>\"\"),$D32,IF(AND($A32<>\"\",$D32=\"\"),$A32,IF(AND($A32=\"\",$D32=\"\"),\"\",IF(LEFT($F32,1)>RIGHT($F32,1),$A32,$D32)))))","v":"Závětová Lucie  (ST Frýdlant) - U19"},null,null,null,null,"2:3"]
["Semifinále"]
[{"$f":"IF($F35=\"\",\"\",IF(AND($A35=\"\",$D35<>\"\"),D35,IF(AND($A35<>\"\",$D35=\"\"),A35,IF(AND($A35=\"\",$D35=\"\"),\"\",IF(LEFT($F35,1)>RIGHT($F35,1),A35,D35)))))","v":"Táborský Václav  (Sokol STAR Turnov) - U13"},null,null,{"$f":"IF(AND($F36=\"\",$A36=\"\",$D36=\"\"),\"\",IF(AND($A36=\"\",$D36<>\"\"),$D36,IF(AND($A36<>\"\",$D36=\"\"),$A36,IF(AND($A36=\"\",$D36=\"\"),\"\",IF(LEFT($F36,1)>RIGHT($F36,1),$A36,$D36)))))","v":"Adamíra Šimon  (Sokol Tatobity) - U15"},null,"3:2"]
[{"$f":"IF($F37=\"\",\"\",IF(AND($A37=\"\",$D37<>\"\"),D37,IF(AND($A37<>\"\",$D37=\"\"),A37,IF(AND($A37=\"\",$D37=\"\"),\"\",IF(LEFT($F37,1)>RIGHT($F37,1),A37,D37)))))","v":""}]
["Finále"]
[{"$f":"IF($F40=\"\",\"\",IF(AND($A40=\"\",$D40<>\"\"),D40,IF(AND($A40<>\"\",$D40=\"\"),A40,IF(AND($A40=\"\",$D40=\"\"),\"\",IF(LEFT($F40,1)>RIGHT($F40,1),A40,D40)))))","v":"Táborský Václav  (Sokol STAR Turnov) - U13"},null,null,{"$f":"IF($F41=\"\",\"\",IF(AND($A41=\"\",$D41<>\"\"),D41,IF(AND($A41<>\"\",$D41=\"\"),A41,IF(AND($A41=\"\",$D41=\"\"),\"\",IF(LEFT($F41,1)>RIGHT($F41,1),A41,D41)))))","v":""}]

{"sheet":"utecha_umisteni_6","index":29,"n_rows":67,"n_cols":4,"rows_kept":67,"cut":false,"hidden":true,"merged":[[0,1,0,2],[1,1,1,2],[2,1,2,2],[3,1,3,2]]}
["Název soutěže:",{"$f":"A_skupiny!A1","v":"10. KBT Libereckého kraje"}]
[]
["Kategorie, den",{"$f":"A_skupiny!A3","v":"Turnov, 14.05.2022"}]
["Kolo","útěcha"]
[{"$f":"utecha_umisteni_5!A5","v":"o 49. - 64. místo"}]
[{"$f":"IF(utecha_umisteni_5!A6=\"\",\"\",utecha_umisteni_5!A6)","v":"Hanoušek Adam  (Sokol Turnov) - U13"}]
[null,{"$f":"utecha_umisteni_5!A26","v":"Fišer Václav  (KMST Liberec) - U15"}]
[{"$f":"IF(utecha_umisteni_5!D6=\"\",\"\",utecha_umisteni_5!D6)","v":"Fišer Václav  (KMST Liberec) - U15"},{"$f":"IF(utecha_umisteni_5!F6=\"\",\"\",IF(LEFT(utecha_umisteni_5!F6,1)>RIGHT(utecha_umisteni_5!F6,1),utecha_umisteni_5!F6,RIGHT(utecha_umisteni_5!F6,1)&\":\"&LEFT(utecha_umisteni_5!F6,1)))","v":"3:0"}]
[null,null,{"$f":"utecha_umisteni_5!A35","v":"Fišer Václav  (KMST Liberec) - U15"}]
[{"$f":"IF(utecha_umisteni_5!A7=\"\",\"\",utecha_umisteni_5!A7)","v":"Resl Teodor  (SKST Liberec) - U11"},null,{"$f":"IF(utecha_umisteni_5!F26=\"\",\"\",IF(LEFT(utecha_umisteni_5!F26,1)>RIGHT(utecha_umisteni_5!F26,1),utecha_umisteni_5!F26,RIGHT(utecha_umisteni_5!F26,1)&\":\"&LEFT(utecha_umisteni_5!F26,1)))","v":"3:0"}]
[null,{"$f":"utecha_umisteni_5!D26","v":"Resl Teodor  (SKST Liberec) - U11"}]
[{"$f":"IF(utecha_umisteni_5!D7=\"\",\"\",utecha_umisteni_5!D7)","v":"Sulovský Kryštof  (KMST Liberec) - U11"},{"$f":"IF(utecha_umisteni_5!F7=\"\",\"\",IF(LEFT(utecha_umisteni_5!F7,1)>RIGHT(utecha_umisteni_5!F7,1),utecha_umisteni_5!F7,RIGHT(utecha_umisteni_5!F7,1)&\":\"&LEFT(utecha_umisteni_5!F7,1)))","v":"3:0"}]
[null,null,null,{"$f":"utecha_umisteni_5!$A$40","v":"Táborský Václav  (Sokol STAR Turnov) - U13"}]
[{"$f":"IF(utecha_umisteni_5!A8=\"\",\"\",utecha_umisteni_5!A8)","v":"Benešová  (Spartak Chrastava) - "},null,null,{"$f":"IF(utecha_umisteni_5!F35=\"\",\"\",IF(LEFT(utecha_umisteni_5!F35,1)>RIGHT(utecha_umisteni_5!F35,1),utecha_umisteni_5!F35,RIGHT(utecha_umisteni_5!F35,1)&\":\"&LEFT(utecha_umisteni_5!F35,1)))","v":"3:0"}]
[null,{"$f":"utecha_umisteni_5!A27","v":"Bitman Matěj  (KMST Liberec) - U15"}]
[{"$f":"IF(utecha_umisteni_5!D8=\"\",\"\",utecha_umisteni_5!D8)","v":"Bitman Matěj  (KMST Liberec) - U15"},{"$f":"IF(utecha_umisteni_5!F8=\"\",\"\",IF(LEFT(utecha_umisteni_5!F8,1)>RIGHT(utecha_umisteni_5!F8,1),utecha_umisteni_5!F8,RIGHT(utecha_umisteni_5!F8,1)&\":\"&LEFT(utecha_umisteni_5!F8,1)))","v":"3:0"}]
[null,null,{"$f":"utecha_umisteni_5!D35","v":"Táborský Václav  (Sokol STAR Turnov) - U13"}]
[{"$f":"IF(utecha_umisteni_5!A9=\"\",\"\",utecha_umisteni_5!A9)","v":"Čupcová Valerie  (Jiskra Nový Bor) - U11"},null,{"$f":"IF(utecha_umisteni_5!F27=\"\",\"\",IF(LEFT(utecha_umisteni_5!F27,1)>RIGHT(utecha_umisteni_5!F27,1),utecha_umisteni_5!F27,RIGHT(utecha_umisteni_5!F27,1)&\":\"&LEFT(utecha_umisteni_5!F27,1)))","v":"3:1"}]
[null,{"$f":"utecha_umisteni_5!D27","v":"Táborský Václav  (Sokol STAR Turnov) - U13"}]
[{"$f":"IF(utecha_umisteni_5!D9=\"\",\"\",utecha_umisteni_5!D9)","v":"Táborský Václav  (Sokol STAR Turnov) - U13"},{"$f":"IF(utecha_umisteni_5!F9=\"\",\"\",IF(LEFT(utecha_umisteni_5!F9,1)>RIGHT(utecha_umisteni_5!F9,1),utecha_umisteni_5!F9,RIGHT(utecha_umisteni_5!F9,1)&\":\"&LEFT(utecha_umisteni_5!F9,1)))","v":"3:0"}]
[null,null,null,{"$f":"utecha_umisteni_5!$A$43","v":"Táborský Václav  (Sokol STAR Turnov) - U13"}]
[{"$f":"IF(utecha_umisteni_5!A10=\"\",\"\",utecha_umisteni_5!A10)","v":"Bartoň David  (SKST Liberec) - U15"},null,null,{"$f":"IF(utecha_umisteni_5!$F$40=\"\",\"\",IF(LEFT(utecha_umisteni_5!$F$40,1)>RIGHT(utecha_umisteni_5!$F$40,1),utecha_umisteni_5!$F$40,RIGHT(utecha_umisteni_5!$F$40,1)&\":\"&LEFT(utecha_umisteni_5!$F$40,1)))","v":"3:2"}]
[null,{"$f":"utecha_umisteni_5!A28","v":"Bartoň David  (SKST Liberec) - U15"}]
[{"$f":"IF(utecha_umisteni_5!D10=\"\",\"\",utecha_umisteni_5!D10)","v":"Severýn Kryštof  (Spartak Chrastava) - U13"},{"$f":"IF(utecha_umisteni_5!F10=\"\",\"\",IF(LEFT(utecha_umisteni_5!F10,1)>RIGHT(utecha_umisteni_5!F10,1),utecha_umisteni_5!F10,RIGHT(utecha_umisteni_5!F10,1)&\":\"&LEFT(utecha_umisteni_5!F10,1)))","v":"3:0"}]
[null,null,{"$f":"utecha_umisteni_5!A36","v":"Bartoň David  (SKST Liberec) - U15"}]
[{"$f":"IF(utecha_umisteni_5!A11=\"\",\"\",utecha_umisteni_5!A11)","v":""},null,{"$f":"IF(utecha_umisteni_5!F28=\"\",\"\",IF(LEFT(utecha_umisteni_5!F28,1)>RIGHT(utecha_umisteni_5!F28,1),utecha_umisteni_5!F28,RIGHT(utecha_umisteni_5!F28,1)&\":\"&LEFT(utecha_umisteni_5!F28,1)))","v":""}]
[null,{"$f":"utecha_umisteni_5!D28","v":""}]
[{"$f":"IF(utecha_umisteni_5!D11=\"\",\"\",utecha_umisteni_5!D11)","v":""},{"$f":"IF(utecha_umisteni_5!F11=\"\",\"\",IF(LEFT(utecha_umisteni_5!F11,1)>RIGHT(utecha_umisteni_5!F11,1),utecha_umisteni_5!F11,RIGHT(utecha_umisteni_5!F11,1)&\":\"&LEFT(utecha_umisteni_5!F11,1)))","v":""}]
[null,null,null,{"$f":"utecha_umisteni_5!D40","v":"Adamíra Šimon  (Sokol Tatobity) - U15"}]
[{"$f":"IF(utecha_umisteni_5!A12=\"\",\"\",utecha_umisteni_5!A12)","v":"Šerpán Radek  (Sokol Turnov) - U15"},null,null,{"$f":"IF(utecha_umisteni_5!F36=\"\",\"\",IF(LEFT(utecha_umisteni_5!F36,1)>RIGHT(utecha_umisteni_5!F36,1),utecha_umisteni_5!F36,RIGHT(utecha_umisteni_5!F36,1)&\":\"&LEFT(utecha_umisteni_5!F36,1)))","v":"3:1"}]
[null,{"$f":"utecha_umisteni_5!A29","v":"Adamíra Šimon  (Sokol Tatobity) - U15"}]
[{"$f":"IF(utecha_umisteni_5!D12=\"\",\"\",utecha_umisteni_5!D12)","v":"Adamíra Šimon  (Sokol Tatobity) - U15"},{"$f":"IF(utecha_umisteni_5!F12=\"\",\"\",IF(LEFT(utecha_umisteni_5!F12,1)>RIGHT(utecha_umisteni_5!F12,1),utecha_umisteni_5!F12,RIGHT(utecha_umisteni_5!F12,1)&\":\"&LEFT(utecha_umisteni_5!F12,1)))","v":"3:1"}]
[null,null,{"$f":"utecha_umisteni_5!D36","v":"Adamíra Šimon  (Sokol Tatobity) - U15"}]
[{"$f":"IF(utecha_umisteni_5!A13=\"\",\"\",utecha_umisteni_5!A13)","v":"Žagan Štěpán  (KMST Liberec) - U15"},null,{"$f":"IF(utecha_umisteni_5!F29=\"\",\"\",IF(LEFT(utecha_umisteni_5!F29,1)>RIGHT(utecha_umisteni_5!F29,1),utecha_umisteni_5!F29,RIGHT(utecha_umisteni_5!F29,1)&\":\"&LEFT(utecha_umisteni_5!F29,1)))","v":"3:1"}]
[null,{"$f":"utecha_umisteni_5!D29","v":"Kutěj Štěpán  (Sokol Turnov) - U15"}]
[{"$f":"IF(utecha_umisteni_5!D13=\"\",\"\",utecha_umisteni_5!D13)","v":"Kutěj Štěpán  (Sokol Turnov) - U15"},{"$f":"IF(utecha_umisteni_5!F13=\"\",\"\",IF(LEFT(utecha_umisteni_5!F13,1)>RIGHT(utecha_umisteni_5!F13,1),utecha_umisteni_5!F13,RIGHT(utecha_umisteni_5!F13,1)&\":\"&LEFT(utecha_umisteni_5!F13,1)))","v":"3:2"}]
[]
[{"$f":"utecha_umisteni_5!A14","v":"o 41. - 48. místo"}]
[{"$f":"IF(utecha_umisteni_5!A15=\"\",\"\",utecha_umisteni_5!A15)","v":"Kovář Samuel  (SKST Liberec) - U13"}]
[null,{"$f":"utecha_umisteni_5!A30","v":"Kovář Samuel  (SKST Liberec) - U13"}]
[{"$f":"IF(utecha_umisteni_5!D15=\"\",\"\",utecha_umisteni_5!D15)","v":"Vrběcký Daniel  (Bižuterie Jablonec n. N.) - U17"},{"$f":"IF(utecha_umisteni_5!F15=\"\",\"\",IF(LEFT(utecha_umisteni_5!F15,1)>RIGHT(utecha_umisteni_5!F15,1),utecha_umisteni_5!F15,RIGHT(utecha_umisteni_5!F15,1)&\":\"&LEFT(utecha_umisteni_5!F15,1)))","v":"3:0"}]
[null,null,{"$f":"utecha_umisteni_5!A37","v":"Kovář Samuel  (SKST Liberec) - U13"}]
[{"$f":"IF(utecha_umisteni_5!A16=\"\",\"\",utecha_umisteni_5!A16)","v":"Hanusová Karolína  (Jiskra Kamenický Šenov) - U13"},null,{"$f":"IF(utecha_umisteni_5!F30=\"\",\"\",IF(LEFT(utecha_umisteni_5!F30,1)>RIGHT(utecha_umisteni_5!F30,1),utecha_umisteni_5!F30,RIGHT(utecha_umisteni_5!F30,1)&\":\"&LEFT(utecha_umisteni_5!F30,1)))","v":"3:0"}]
[null,{"$f":"utecha_umisteni_5!D30","v":"Perlík Josef  (KMST Liberec) - U11"}]
[{"$f":"IF(utecha_umisteni_5!D16=\"\",\"\",utecha_umisteni_5!D16)","v":"Perlík Josef  (KMST Liberec) - U11"},{"$f":"IF(utecha_umisteni_5!F16=\"\",\"\",IF(LEFT(utecha_umisteni_5!F16,1)>RIGHT(utecha_umisteni_5!F16,1),utecha_umisteni_5!F16,RIGHT(utecha_umisteni_5!F16,1)&\":\"&LEFT(utecha_umisteni_5!F16,1)))","v":"3:0"}]
[null,null,null,{"$f":"utecha_umisteni_5!A41","v":""}]
[{"$f":"IF(utecha_umisteni_5!A17=\"\",\"\",utecha_umisteni_5!A17)","v":"Kubíček Tomáš  (Sokol Turnov) - U15"},null,null,{"$f":"IF(utecha_umisteni_5!F37=\"\",\"\",IF(LEFT(utecha_umisteni_5!F37,1)>RIGHT(utecha_umisteni_5!F37,1),utecha_umisteni_5!F37,RIGHT(utecha_umisteni_5!F37,1)&\":\"&LEFT(utecha_umisteni_5!F37,1)))","v":""}]
[null,{"$f":"utecha_umisteni_5!A31","v":"Kubíček Tomáš  (Sokol Turnov) - U15"}]
[{"$f":"IF(utecha_umisteni_5!D17=\"\",\"\",utecha_umisteni_5!D17)","v":"Šťastný Jiří  (KMST Liberec) - U13"},{"$f":"IF(utecha_umisteni_5!F17=\"\",\"\",IF(LEFT(utecha_umisteni_5!F17,1)>RIGHT(utecha_umisteni_5!F17,1),utecha_umisteni_5!F17,RIGHT(utecha_umisteni_5!F17,1)&\":\"&LEFT(utecha_umisteni_5!F17,1)))","v":"3:0"}]
[null,null,{"$f":"utecha_umisteni_5!D37","v":"Hůlková Anna  (SKST Liberec) - U17"}]
[{"$f":"IF(utecha_umisteni_5!A18=\"\",\"\",utecha_umisteni_5!A18)","v":"Hůlková Anna  (SKST Liberec) - U17"},null,{"$f":"IF(utecha_umisteni_5!F31=\"\",\"\",IF(LEFT(utecha_umisteni_5!F31,1)>RIGHT(utecha_umisteni_5!F31,1),utecha_umisteni_5!F31,RIGHT(utecha_umisteni_5!F31,1)&\":\"&LEFT(utecha_umisteni_5!F31,1)))","v":"3:0"}]
[null,{"$f":"utecha_umisteni_5!D31","v":"Hůlková Anna  (SKST Liberec) - U17"}]
[{"$f":"IF(utecha_umisteni_5!D18=\"\",\"\",utecha_umisteni_5!D18)","v":"Opluštil Jan  (Sokol STAR Turnov) - U17"},{"$f":"IF(utecha_umisteni_5!F18=\"\",\"\",IF(LEFT(utecha_umisteni_5!F18,1)>RIGHT(utecha_umisteni_5!F18,1),utecha_umisteni_5!F18,RIGHT(utecha_umisteni_5!F18,1)&\":\"&LEFT(utecha_umisteni_5!F18,1)))","v":"3:0"}]
[]
[{"$f":"utecha_umisteni_5!A19","v":"o 37. - 40.  místo"}]
[{"$f":"IF(utecha_umisteni_5!A20=\"\",\"\",utecha_umisteni_5!A20)","v":"Závětová Lucie  (ST Frýdlant) - U19"},null,{"$f":"IF(utecha_umisteni_5!F69=\"\",\"\",IF(LEFT(utecha_umisteni_5!F69,1)>RIGHT(utecha_umisteni_5!F69,1),utecha_umisteni_5!F69,RIGHT(utecha_umisteni_5!F69,1)&\":\"&LEFT(utecha_umisteni_5!F69,1)))","v":""}]
[null,{"$f":"utecha_umisteni_5!A32","v":"Závětová Lucie  (ST Frýdlant) - U19"}]
[{"$f":"IF(utecha_umisteni_5!D20=\"\",\"\",utecha_umisteni_5!D20)","v":"Motlík Denis  (Loko Česká Lípa) - U15"},{"$f":"IF(utecha_umisteni_5!F20=\"\",\"\",IF(LEFT(utecha_umisteni_5!F20,1)>RIGHT(utecha_umisteni_5!F20,1),utecha_umisteni_5!F20,RIGHT(utecha_umisteni_5!F20,1)&\":\"&LEFT(utecha_umisteni_5!F20,1)))","v":"3:0"}]
[null,null,{"$f":"utecha_umisteni_5!A38","v":"Závětová Lucie  (ST Frýdlant) - U19"}]
[{"$f":"IF(utecha_umisteni_5!A21=\"\",\"\",utecha_umisteni_5!A21)","v":"Flégr Samuel  (KMST Liberec) - "},null,{"$f":"IF(utecha_umisteni_5!F32=\"\",\"\",IF(LEFT(utecha_umisteni_5!F32,1)>RIGHT(utecha_umisteni_5!F32,1),utecha_umisteni_5!F32,RIGHT(utecha_umisteni_5!F32,1)&\":\"&LEFT(utecha_umisteni_5!F32,1)))","v":"3:1"}]
[null,{"$f":"utecha_umisteni_5!D32","v":"Korpová Tereza  (AST Kamenický Šenov) - U11"}]
[{"$f":"IF(utecha_umisteni_5!D21=\"\",\"\",utecha_umisteni_5!D21)","v":"Korpová Tereza  (AST Kamenický Šenov) - U11"},{"$f":"IF(utecha_umisteni_5!F21=\"\",\"\",IF(LEFT(utecha_umisteni_5!F21,1)>RIGHT(utecha_umisteni_5!F21,1),utecha_umisteni_5!F21,RIGHT(utecha_umisteni_5!F21,1)&\":\"&LEFT(utecha_umisteni_5!F21,1)))","v":"3:0"}]
[]
[{"$f":"utecha_umisteni_5!A22","v":"o 35. - 36. místo"}]
[{"$f":"IF(utecha_umisteni_5!A23=\"\",\"\",utecha_umisteni_5!A23)","v":"Kuntoš Filip  (SKST Liberec) - U17"}]
[null,{"$f":"utecha_umisteni_5!A33","v":"Kuntoš Filip  (SKST Liberec) - U17"}]
[{"$f":"IF(utecha_umisteni_5!D23=\"\",\"\",utecha_umisteni_5!D23)","v":"Königová Anežka  (Sokol STAR Turnov) - U15"},{"$f":"IF(utecha_umisteni_5!F23=\"\",\"\",IF(LEFT(utecha_umisteni_5!F23,1)>RIGHT(utecha_umisteni_5!F23,1),utecha_umisteni_5!F23,RIGHT(utecha_umisteni_5!F23,1)&\":\"&LEFT(utecha_umisteni_5!F23,1)))","v":"3:0"}]

{"sheet":"makro","index":30,"n_rows":0,"n_cols":0,"rows_kept":0,"cut":false,"hidden":true,"merged":[]}